{"text_format":"1","workbook":"xlsx","n_sheets":7,"sheets":["Interfaz","Poblacion","etapas y mredes","Etapas de Vida","Piramide Poblacional","Demografia","Pobla_EESS"],"not_rendered":{"charts":7,"images":21,"macros":1,"external_links":1,"defined_names":42,"comments":0,"pivot_tables":0},"unopened":[],"bounds":{"document_bytes":16777216,"sheet_cells":100000,"rows_first":2000,"rows_last":500,"rows_between":2000,"halvings":0,"cell_chars":16384,"cell_head_chars":4096},"cells_cut":0,"cells_raw":0,"read":"whole","date_system":"1900"}

{"sheet":"Interfaz","index":0,"n_rows":27,"n_cols":18,"rows_kept":27,"cut":false,"hidden":false,"merged":[[4,2,7,11],[9,2,11,11]]}
[]
[]
[]
[]
[null,null,"POBLACIÓN ASIGNADA 2024 SEGÚN CENSOS INEI - RENIEC - PN - CNV"]
[]
[]
[]
[]
[null,null,"RED INTEGRADA DE SALUD HUAURA OYÓN"]
{"$rows_left_out":18}
{"sheet":"Poblacion","index":1,"n_rows":93,"n_cols":124,"rows_kept":93,"cut":false,"hidden":false,"merged":[[4,116,5,117],[4,118,5,119],[4,120,5,121],[4,122,5,123],[3,114,3,123],[4,115,6,115],[4,114,6,114],[5,101,6,101],[4,101,4,106],[4,108,4,112],[5,108,5,109],[5,110,6,110],[5,111,6,111],[5,112,6,112],[5,106,6,106],[5,105,6,105],[5,104,6,104],[5,103,6,103],[5,102,6,102],[2,88,2,95],[4,95,6,95],[4,94,6,94],[4,93,6,93],[4,88,6,88],[4,89,6,89],[4,90,6,90],[4,92,6,92],[4,91,6,91],[4,58,4,59],[5,66,5,67],[5,58,5,59],[4,56,4,57],[5,56,5,57],[5,74,5,75],[4,97,6,97],[4,98,6,98],[4,99,6,99],[4,81,6,81],[4,82,6,82],[4,83,5,85],[4,86,6,86],[4,76,4,80],[5,77,5,78],[5,79,5,80],[4,72,4,73],[4,74,4,75],[4,60,4,61],[4,62,4,63],[4,68,4,69],[5,68,5,69],[4,70,4,71],[5,70,5,71],[5,72,5,73],[5,62,5,63],[4,64,4,65],[5,64,5,65],[4,66,4,67],[5,60,5,61],[5,44,5,45],[5,46,5,47],[5,48,5,49],[5,50,5,51],[4,50,4,51],[4,48,4,49],[5,36,5,37],[4,52,4,53],[4,54,4,55],[5,52,5,53],[5,54,5,55],[1,18,1,43],[2,18,2,43],[4,36,4,37],[4,26,4,27],[3,18,3,43],[4,24,4,25],[5,24,5,25],[4,34,4,35],[4,16,4,17],[4,18,4,19],[5,16,5,17],[5,18,5,19],[4,20,4,21],[5,20,5,21],[4,22,4,23],[5,22,5,23],[4,28,4,29],[4,5,6,5],[4,44,4,45],[4,46,4,47],[4,7,6,7],[4,8,6,8],[5,28,5,29],[4,30,4,31],[5,30,5,31],[4,32,4,33],[5,32,5,33],[4,38,4,39],[5,38,5,39],[4,40,4,41],[5,40,5,41],[4,42,4,43],[5,42,5,43],[5,26,5,27],[5,34,5,35],[4,10,4,11],[5,10,5,11],[4,12,4,13],[5,12,5,13],[4,14,4,15],[5,14,5,15]]}
[null,null,1,2,3,4,5,6,7,8,9,10,11,12,13,14,15,16,17,18,19,20,21,22,23,24,25,26,27,28,29,30,31,32,33,34,35,36,37,38,39,40,41,42,43,44,45,46,47,48,49,50,51,52,53,54,55,56,57,58,59,60,61,62,63,64,65,66,67,68,69,70,71,72,73,74,75,76,77,78,79,80,81,82,83,84,85,86,87,88,89,90,91,92,93,94,95,96,97,98,99,100,101,102,103,104,105,106,107,108,109,110,111,112,113,114,115,116,117,118,119,120,121,122]
[null,null,null,null,null,null,null,null,null,null,null,null,null,null,null,null,null,null,"POBLACIÓN ESTIMADA POR GRUPOS DE EDAD, SEGÚN PROVINCIAS DISTRITOS Y ESTABLECIMIENTOS DE SALUD"]
[null,null,null,null,null,null,null,null,null,null,null,null,null,null,null,null,null,null,"RED INTEGRADA DE SALUD HUAURA OYON   -   AÑO  2024",null,null,null,null,null,null,null,null,null,null,null,null,null,null,null,null,null,null,null,null,null,null,null,null,null,null,null,null,null,null,null,null,null,null,null,null,null,null,null,null,null,null,null,null,null,null,null,null,null,null,null,null,null,null,null,null,null,null,null,null,null,null,null,null,null,null,null,null,null,"MAS GRUPOS DE EDAD"]
[null,null,null,null,null,null,null,null,null,null,null,null,null,null,null,null,null,null,"EDADES PUNTUALES Y GRUPOS DE EDAD",null,null,null,null,null,null,null,null,null,null,null,null,null,null,null,null,null,null,null,null,null,null,null,null,null,null,null,null,null,null,null,null,null,null,null,null,null,null,null,null,null,null,null,null,null,null,null,null,null,null,null,null,null,null,null,null,null,null,null,null,null,null,null,null,null,null,null,null,null,null,null,null,null,null,null,null,null,null,null,null,null,null,null,null,null,null,null,null,null,null,null,null,null,null,null,"Varones"]
[null,null,"N°",null,"DIRECCION DE SALUD","TOTAL GENERAL",null,"TOTAL MASCULINO","TOTAL FEMENINO",null,"EDAD",null,"EDAD",null,"EDAD",null,"EDAD",null,"EDAD",null,"EDAD",null,"EDAD",null,"EDAD",null,"EDAD",null,"EDAD",null,"EDAD",null,"EDAD",null,"EDAD",null,"EDAD",null,"EDAD",null,"EDAD",null,"EDAD",null,"EDAD",null,"EDAD",null,"EDAD",null,"EDAD",null,"EDAD",null,"EDAD",null,"EDAD",null,"EDAD",null,"EDAD",null,"EDAD",null,"EDAD",null,"EDAD",null,"EDAD",null,"EDAD",null,"EDAD",null,"EDAD",null,"EDADES ESPECIALES",null,null,null,null,"NACIMIENTOS","POBLACION FEMENINA TOTAL","POBLACION FEMENINA",null,null,"GESTANTES  ESPERADAS",null,"menor de 1 Año","Pre escolar         (1-4)","Niño             (0 - 11)","Escolar               (05 - 17)","Adolescente (12 - 17)","Adulto Joven (18 - 29)","Adulto            (30-59)","Adu.Mayor (60 a MAS)",null,"Escolar               (05 - 09)","Adolescente (10 - 19)","Adulto            (20-59)",null,"Poblacion: PADRON NOMINAL al 31_12_2023",null,null,null,null,null,null,"OTROS GRUPOS ESPECIALES (CONVENIO)",null,null,null,null,null,"Población Hombres Adolescentes               (14 -17 años)","Población Hombres (18 - 59 años)","(0 -13 años)",null,"(14 -17 años)",null,"(18 -59 años)",null,"(60 años a màs)"]
["UBIGEO",null,null,null,"PROVINCIA",null,null,null,null,null,0,null,1,null,2,null,3,null,4,null,5,null,6,null,7,null,8,null,9,null,10,null,11,null,12,null,13,null,14,null,15,null,16,null,17,null,18,null,19,null,"20 - 24 ",null,"25 - 29 ",null,"30 - 34 ",null,"35 - 39 ",null,"40 - 44 ",null,"45 - 49 ",null,"50 - 54 ",null,"55 - 59",null,"60 - 64 ",null,"65 - 69",null,"70 - 74",null,"75 - 79 ",null,"80 y ++",null,null,"0-5 MESES",null,"6-11 MESES",null,null,null,null,null,null,null,null,null,null,null,null,null,null,null,null,null,null,null,null,null,"0A","1A","2A","3A","4A","5A",null,"25 - 64 (Cancer)",null,"50 - 64 (PAP)","30 - 49 (IVVA)","15 - 49 (MEF)"]
[null,"Microredes",null,"RENAES","DISTRITO",null,null,null,null,null,"M","F","M","F","M","F","M","F","M","F","M","F","M","F","M","F","M","F","M","F","M","F","M","F","M","F","M","F","M","F","M","F","M","F","M","F","M","F","M","F","M","F","M","F","M","F","M","F","M","F","M","F","M","F","M","F","M","F","M","F","M","F","M","F","M","F","28 DIAS","M","F","M","F",null,null," 10 - 14","15 - 19","20 - 49",null,null,null,null,null,null,null,null,null,null,null,null,null,null,null,null,null,null,null,null,null,null,"M","F",null,null,null,null,null,null,"M","F","M","F","M","F","M","F"]
[150000,null,1,null,"HUAURA - OYON",282245,null,136079,146166,null,1791,1800,1773,1770,1814,1806,1951,1882,2088,1956,2111,2012,2395,2513,2473,2490,2410,2565,2351,2478,2344,2300,2343,2404,2495,2485,2365,2479,2234,2284,2226,2403,2183,2286,2098,2220,2126,2155,1998,2151,10163,10755,11460,12646,10442,11647,10023,10979,9181,9858,8430,9184,7433,8087,6413,7097,5390,5833,4382,4867,3450,3769,2489,2872,3254,4133,205,850,821,941,979,4778,0,11952,11215,65069,7591,null,{"$f":"K8+L8","v":3591},{"$f":"SUM(M8:T8)","v":15040},{"$f":"SUM(K8:AH8)","v":51820},{"$f":"SUM(U8:AT8)","v":60947},{"$f":"SUM(AI8:AT8)","v":27758},{"$f":"SUM(AU8:BB8)","v":53454},{"$f":"SUM(BC8:BN8)","v":108774},{"$f":"SUM(BO8:BX8)","v":40439},null,{"$f":"SUM(U8:AD8)","v":23798},{"$f":"SUM(AE8:AX8)","v":45579},{"$f":"SUM(AY8:BX8)","v":194237},null,3591,3543,3620,3833,4044,4123,null,{"$f":"BA8+BC8+BE8+BG8+BI8+BK8+BM8+BO8","v":68772},{"$f":"BB8+BD8+BF8+BH8+BJ8+BL8+BN8+BP8","v":75331},{"$f":"BL8+BN8+BP8","v":21017},{"$f":"BD8+BF8+BH8+BJ8","v":41668},{"$f":"AP8+AR8+AT8+AV8+AX8+AZ8+BB8+BD8+BF8+BH8+BJ8","v":76284},null,{"$f":"AM8+AO8+AQ8+AS8","v":8741},{"$f":"AU8+AW8+AY8+BA8+BC8+BE8+BG8+BI8+BK8+BM8","v":77669},{"$f":"K8+M8+O8+Q8+S8+U8+W8+Y8+AA8+AC8+AE8+AG8+AI8+AK8","v":30704},{"$f":"L8+N8+P8+R8+T8+V8+X8+Z8+AB8+AD8+AF8+AH8+AJ8+AL8","v":30940},{"$f":"AM8+AO8+AQ8+AS8","v":8741},{"$f":"AN8+AP8+AR8+AT8","v":9193},{"$f":"AU8+AW8+AY8+BA8+BC8+BE8+BG8+BK8+BM8+BI8","v":77669},{"$f":"AV8+AX8+AZ8+BB8+BD8+BF8+BH8+BL8+BN8+BJ8","v":84559},{"$f":"BO8+BQ8+BS8+BU8+BW8","v":18965},{"$f":"BP8+BR8+BT8+BV8+BX8","v":21474}]
[150800,null,2,150800,"PROVINCIA HUAURA",264367,null,127484,136883,null,1674,1682,1667,1653,1712,1696,1836,1768,1958,1838,1978,1873,2249,2365,2325,2334,2273,2392,2187,2306,2169,2120,2166,2221,2313,2273,2166,2277,2073,2105,2039,2197,2010,2076,1929,2052,1965,2001,1862,2008,9506,10064,10788,11919,9851,10958,9432,10325,8677,9361,7922,8685,6975,7600,6030,6675,5039,5475,4108,4576,3229,3540,2336,2672,3040,3796,181,796,766,878,916,4456,0,10996,10334,61312,7142,null,{"$f":"K9+L9","v":3356},{"$f":"SUM(M9:T9)","v":14128},{"$f":"SUM(K9:AH9)","v":48442},{"$f":"SUM(U9:AT9)","v":56468},{"$f":"SUM(AI9:AT9)","v":25510},{"$f":"SUM(AU9:BB9)","v":50113},{"$f":"SUM(BC9:BN9)","v":102491},{"$f":"SUM(BO9:BX9)","v":37811},null,{"$f":"SUM(U9:AD9)","v":22282},{"$f":"SUM(AE9:AX9)","v":42022},{"$f":"SUM(AY9:BX9)","v":182579},null,3356,3320,3408,3604,3796,3851,null,{"$f":"BA9+BC9+BE9+BG9+BI9+BK9+BM9+BO9","v":64714},{"$f":"BB9+BD9+BF9+BH9+BJ9+BL9+BN9+BP9","v":70998},{"$f":"BL9+BN9+BP9","v":19750},{"$f":"BD9+BF9+BH9+BJ9","v":39329},{"$f":"AP9+AR9+AT9+AV9+AX9+AZ9+BB9+BD9+BF9+BH9+BJ9","v":71646},null,{"$f":"AM9+AO9+AQ9+AS9","v":8051},{"$f":"AU9+AW9+AY9+BA9+BC9+BE9+BG9+BI9+BK9+BM9","v":73008},{"$f":"K9+M9+O9+Q9+S9+U9+W9+Y9+AA9+AC9+AE9+AG9+AI9+AK9","v":28673},{"$f":"L9+N9+P9+R9+T9+V9+X9+Z9+AB9+AD9+AF9+AH9+AJ9+AL9","v":28798},{"$f":"AM9+AO9+AQ9+AS9","v":8051},{"$f":"AN9+AP9+AR9+AT9","v":8430},{"$f":"AU9+AW9+AY9+BA9+BC9+BE9+BG9+BK9+BM9+BI9","v":73008},{"$f":"AV9+AX9+AZ9+BB9+BD9+BF9+BH9+BL9+BN9+BJ9","v":79596},{"$f":"BO9+BQ9+BS9+BU9+BW9","v":17752},{"$f":"BP9+BR9+BT9+BV9+BX9","v":20059}]
[150801,null,3,150802,"DISTRITO HUACHO",75089,null,36163,38926,null,325,338,373,347,334,336,386,384,494,443,459,427,599,626,629,584,625,669,605,642,593,569,594,560,578,589,574,597,534,546,542,578,543,548,527,539,571,518,509,515,2578,2601,2822,3181,2646,2968,2669,2826,2548,2739,2389,2614,2213,2407,1945,2181,1667,1881,1412,1594,1074,1288,752,912,1054,1379,39,147,140,178,198,902,0,2861,2698,16929,1483,null,663,3097,11941,14876,6695,13295,30145,13013,null,5865,11124,54340,null,663,720,670,770,937,886,null,18899,20797,6469,11147,19627,null,2146,20890,7168,7111,2146,2211,20890,22550,5959,7054]
{"$rows_left_out":84}
{"sheet":"etapas y mredes","index":2,"n_rows":24,"n_cols":21,"rows_kept":24,"cut":false,"hidden":false,"merged":[[6,15,6,20],[6,2,6,11],[1,2,5,12]]}
[]
[null,null,"POBLACION ASIGNADA POR DISTRITO SIERRA, HOSPITAL, MICROREDES Y POR ETAPAS DE VIDA 2024"]
[]
[]
[]
[]
[null,null,"DISTRITO",null,null,null,null,null,null,null,null,null,null,null,null,"MICROREDES"]
[null,null,65,67,11,73,59,28,75,33,null,null,null,4,null,82,83,84,85,86]
[null,"POBLACION POR\nETAPAS DE VIDA","Andajes","Caujul","Checras","Naván","Oyón","Paccho","Pachangara","Santa Leonor","Total","PORC. (%)",null,"HOSPITAL HUACHO",null,"HUAURA","HUALMAY","SAYAN","VEGUETA","CHURIN OYON","Total Microredes"]
[75,"Neonatal (0-28dias)",{"$f":"VLOOKUP(C$8,Poblacion!$C$8:$DI$93,$A10,FALSE)","v":0},{"$f":"VLOOKUP(D$8,Poblacion!$C$8:$DI$93,$A10,FALSE)","v":0},{"$f":"VLOOKUP(E$8,Poblacion!$C$8:$DI$93,$A10,FALSE)","v":3},{"$f":"VLOOKUP(F$8,Poblacion!$C$8:$DI$93,$A10,FALSE)","v":1},{"$f":"VLOOKUP(G$8,Poblacion!$C$8:$DI$93,$A10,FALSE)","v":19},{"$f":"VLOOKUP(H$8,Poblacion!$C$8:$DI$93,$A10,FALSE)","v":1},{"$f":"VLOOKUP(I$8,Poblacion!$C$8:$DI$93,$A10,FALSE)","v":2},{"$f":"VLOOKUP(J$8,Poblacion!$C$8:$DI$93,$A10,FALSE)","v":1},{"$f":"+SUM(C10:J10)","v":27},{"$f":"IFERROR((K10/$K$23)*100,0)","v":0.14012871081586048},null,{"$f":"VLOOKUP(N$8,Poblacion!$C$8:$DI$93,$A10,FALSE)","v":28},null,{"$f":"VLOOKUP(P$8,Poblacion!$C$8:$DI$93,$A10,FALSE)","v":40},{"$f":"VLOOKUP(Q$8,Poblacion!$C$8:$DI$93,$A10,FALSE)","v":62},{"$f":"VLOOKUP(R$8,Poblacion!$C$8:$DI$93,$A10,FALSE)","v":24},{"$f":"VLOOKUP(S$8,Poblacion!$C$8:$DI$93,$A10,FALSE)","v":24},{"$f":"VLOOKUP(T$8,Poblacion!$C$8:$DI$93,$A10,FALSE)","v":27},{"$f":"+SUM(P10:T10)","v":177}]
{"$rows_left_out":15}
{"sheet":"Etapas de Vida","index":3,"n_rows":34,"n_cols":6,"rows_kept":34,"cut":false,"hidden":false,"merged":[[1,2,1,4],[39,0,39,14]]}
[]
[]
[]
[]
[86]
[true]
[]
[13]
[]
[]
{"$rows_left_out":25}
{"sheet":"Piramide Poblacional","index":4,"n_rows":154,"n_cols":164,"rows_kept":154,"cut":false,"hidden":false,"merged":[[44,3,46,18],[29,44,29,46],[29,48,29,50],[10,90,10,91],[10,92,10,93],[10,94,10,95],[10,96,10,97],[129,144,129,145],[129,146,129,147],[129,117,129,118],[129,119,129,120],[129,121,129,122],[129,123,129,124],[129,125,129,126],[129,130,129,131],[129,105,129,106],[129,107,129,108],[129,109,129,110],[129,111,129,112],[129,113,129,114],[129,115,129,116],[128,91,130,91],[128,93,128,126],[128,128,130,128],[128,130,128,163],[129,93,129,94],[129,95,129,96],[129,97,129,98],[129,99,129,100],[129,101,129,102],[129,103,129,104],[129,156,129,157],[129,158,129,159],[129,160,129,161],[129,162,129,163],[129,148,129,149],[129,150,129,151],[129,152,129,153],[129,154,129,155],[129,132,129,133],[129,134,129,135],[129,136,129,137],[129,138,129,139],[129,140,129,141],[129,142,129,143],[118,17,118,18],[118,22,118,23],[118,27,118,28],[118,32,118,33],[118,37,118,38],[119,17,119,18],[119,22,119,23],[119,27,119,28],[119,32,119,33],[119,37,119,38],[116,17,116,18],[116,22,116,23],[116,27,116,28],[116,32,116,33],[116,37,116,38],[117,17,117,18],[117,22,117,23],[117,27,117,28],[117,32,117,33],[117,37,117,38],[114,17,114,18],[114,22,114,23],[114,27,114,28],[114,32,114,33],[114,37,114,38],[115,17,115,18],[115,22,115,23],[115,27,115,28],[115,32,115,33],[115,37,115,38],[112,17,112,18],[112,22,112,23],[112,27,112,28],[112,32,112,33],[112,37,112,38],[113,17,113,18],[113,22,113,23],[113,27,113,28],[113,32,113,33],[113,37,113,38],[110,17,110,18],[110,22,110,23],[110,27,110,28],[110,32,110,33],[110,37,110,38],[111,17,111,18],[111,22,111,23],[111,27,111,28],[111,32,111,33],[111,37,111,38],[108,17,108,18],[108,22,108,23],[108,27,108,28],[108,32,108,33],[108,37,108,38],[109,17,109,18],[109,22,109,23],[109,27,109,28],[109,32,109,33],[109,37,109,38],[106,17,106,18],[106,22,106,23],[106,27,106,28],[106,32,106,33],[106,37,106,38],[107,17,107,18],[107,22,107,23],[107,27,107,28],[107,32,107,33],[107,37,107,38],[104,17,104,18],[104,22,104,23],[104,27,104,28],[104,32,104,33],[104,37,104,38],[105,17,105,18],[105,22,105,23],[105,27,105,28],[105,32,105,33],[105,37,105,38],[102,32,102,33],[102,37,102,38],[102,42,102,43],[103,17,103,18],[103,22,103,23],[103,27,103,28],[103,32,103,33],[103,37,103,38],[101,152,101,153],[101,129,102,129],[101,130,101,131],[101,132,101,133],[101,134,101,135],[101,136,101,137],[101,138,101,139],[101,115,101,116],[101,117,101,118],[101,119,101,120],[101,121,101,122],[101,123,101,124],[101,125,101,126],[101,103,101,104],[101,105,101,106],[101,107,101,108],[101,154,101,155],[101,156,101,157],[101,158,101,159],[101,160,101,161],[101,162,101,163],[101,140,101,141],[101,142,101,143],[101,144,101,145],[101,146,101,147],[101,148,101,149],[101,150,101,151],[100,91,102,91],[100,92,100,126],[101,78,101,79],[101,80,101,81],[101,82,101,83],[101,84,101,85],[101,86,101,87],[101,88,101,89],[101,66,101,67],[101,68,101,69],[101,70,101,71],[101,72,101,73],[101,74,101,75],[101,76,101,77],[101,109,101,110],[101,111,101,112],[101,113,101,114],[101,92,102,92],[101,93,101,94],[101,95,101,96],[101,97,101,98],[101,99,101,100],[101,101,101,102],[100,128,102,128],[100,129,100,163],[101,17,101,18],[101,22,101,23],[101,27,101,28],[101,32,101,33],[101,37,101,38],[100,17,100,20],[100,22,100,25],[100,27,100,30],[100,32,100,35],[100,37,100,40],[100,54,102,54],[101,42,101,43],[102,17,102,18],[102,22,102,23],[102,27,102,28],[101,55,102,55],[101,56,101,57],[101,58,101,59],[101,60,101,61],[101,62,101,63],[101,64,101,65],[100,55,100,89],[10,55,11,55],[10,56,10,57],[10,58,10,59],[10,60,10,61],[10,62,10,63],[10,64,10,65],[4,4,4,7],[4,11,4,13],[9,44,9,46],[9,48,9,50],[9,55,9,89],[10,78,10,79],[10,80,10,81],[10,82,10,83],[10,84,10,85],[10,86,10,87],[10,88,10,89],[10,66,10,67],[10,68,10,69],[10,70,10,71],[10,72,10,73],[10,74,10,75],[10,76,10,77]]}
[]
[null,null,null,null,null,null,null,null,{"$f":"CONCATENATE(\"PIRAMIDE POBLACIONAL 2024\")","v":"PIRAMIDE POBLACIONAL 2024"},null,null,null,null,null,null,null,null,null,null,{"$f":"UPPER(\"Piramide Poblacional 2024 - \" &$B$10)","v":"PIRAMIDE POBLACIONAL 2024 - HUAURA - OYON"}]
[]
[]
[null,null,null,null,"ESTABLECIMIENTOS",null,null,null,null,null,null,null,null,null,null,null,null,null,null,null,null,null,null,null,null,null,null,null,null,null,null,null,null,null,null,null,null,null,null,null,null,null,null,null,null,null,null,null,null,"M","F"]
[]
[87,null,null,null,null,null,null,null,null,null,null,null,null,null,null,null,null,null,null,null,null,null,null,null,null,null,null,null,null,null,null,null,null,null,null,null,null,null,null,null,null,null,null,null,null,null,null,null,null,{"$f":"AX8/SUM($AX$8:$AY$8)","v":0.4821307729100604},{"$f":"AY8/SUM($AX$8:$AY$8)","v":0.51786922708993954}]
[null,null,null,null,null,null,null,null,null,null,null,null,null,null,null,null,null,null,null,null,null,null,null,null,null,null,null,null,null,null,null,null,null,null,null,null,null,null,null,null,null,null,null,null,null,null,null,null,null,{"$f":"SUM(AX12:AX28)","v":136079},{"$f":"SUM(AY12:AY28)","v":146166},null,null,1,2,3,4,5,6,7,8,9,10,11,12,13,14,15,16,17,18,19,20,21,22,23,24,25,26,27,28,29,30,31,32,33,34,35,36,37,38,39,40,41,42,43,44,45]
[]
[1,{"$f":"VLOOKUP($A$10,$BB$13:$BC$99,2,FALSE)","v":"HUAURA - OYON"},null,null,null,null,null,null,null,null,null,null,null,null,null,null,null,null,null,null,null,null,null,null,null,null,null,null,null,null,null,null,null,null,null,null,null,null,null,null,null,null,null,null,"DATOS PIRAMIDE",null,null,null,"DATOS PIRAMIDE",null,null,null,null,"N°","DIRECCION DE SALUD","GRUPOS DE EDADES  - PIRAMIDE"]
{"$rows_left_out":145}
{"sheet":"Demografia","index":5,"n_rows":26,"n_cols":14,"rows_kept":26,"cut":false,"hidden":false,"merged":[]}
[]
[null,null,null,null,null,null,"DATOS DEMOGRAFICOS - 2024"]
[null,null,null,null,null,null,"DENSIDAD POBLACIONAL POR DISTRITOS "]
[]
["VINCULOS","DISTRITOS","ALTITUD\n(m.s.n.m.)","LATITUD","LONGITUD","SUPERFICIE\n(Km2)","POBLACION",null,"DENSIDAD\nPOBLACIONAL"]
[null,"HUAURA",null,null,null,4892.5199999999995,{"$f":"+SUM(G7:G18)","v":264367},null,{"$f":"G6/F6","v":54.034934961941907},null,null,null,"XXX","DDD"]
[3,"HUACHO",30,"11º 06' 22''","77º 36' 24''",717.38,{"$f":"+LOOKUP($A$7,NUMERO,TOTAL)","v":75089},null,104.67116451531963,null,null,null,"PACHANGARA",{"$f":"VLOOKUP(M7,$B$7:$I$25,8,FALSE)","v":9.7401309264034914}]
[6,"AMBAR",2082,"10º 45' 10''","77º 16' 19''",919.4,{"$f":"+LOOKUP(A8,NUMERO,TOTAL)","v":2428},null,2.6408527300413316,null,null,null,"OYÓN",8.9886270247342335]
[9,"CARQUIN",14,"10º 05' 21''","77º 37' 36''",2.04,9351,null,4583.8235294117649,null,null,null,"CAUJUL",4.2748815165876781]
[11,"CHECRAS",3743,"10º 55' 54''","76º 49' 52''",166.37,896,null,5.385586343691771,null,null,null,"COCHAMARCA",4.1159856900771983]
{"$rows_left_out":17}
{"sheet":"Pobla_EESS","index":6,"n_rows":60,"n_cols":16,"rows_kept":60,"cut":false,"hidden":false,"merged":[[39,4,45,4],[39,11,41,11],[42,11,46,11],[46,4,49,4],[9,4,13,4],[9,11,11,11],[12,11,16,11],[16,3,16,5],[19,10,19,12],[32,3,32,5],[37,3,37,8],[37,10,37,15],[1,3,4,10],[7,3,7,8],[7,10,7,15],[15,3,15,4],[25,4,29,4],[25,11,30,11],[30,4,31,4],[23,3,23,8],[23,10,23,15],[31,10,31,12],[50,4,52,4],[51,11,54,11],[54,3,54,5],[55,11,57,11],[58,10,58,12]]}
[]
[null,null,null,"POBLACIÓN SEGÚN DISTRITOS Y EE.SS - 2024"]
[]
[]
[]
[]
[]
[null,null,null,"SIN MICRORED",null,null,null,null,null,null,"MICRORED HUALMAY"]
[null,null,null,"DISTRITO","POBLACIÓN","EE.SS","POBLACIÓN","MASCULINO","FEMENINO",null,"DISTRITO","POBLACIÓN","EE.SS","POBLACIÓN","MASCULINO","FEMENINO"]
[null,null,null,"HUACHO",{"$f":"G10","v":54061},"HOSPITAL REGIONAL HUACHO",{"$f":"Poblacion!F11","v":54061},{"$f":"Poblacion!H11","v":26035},{"$f":"Poblacion!I11","v":28026},null,"HUALMAY",{"$f":"SUM(N10:N12)","v":30830},"C.S. HUALMAY",{"$f":"VLOOKUP(M10,Poblacion!$E$5:$I$87,2,FALSE)","v":14801},{"$f":"VLOOKUP(M10,Poblacion!$E$5:$I$87,4,FALSE)","v":7129},{"$f":"VLOOKUP(M10,Poblacion!$E$5:$I$87,5,FALSE)","v":7672}]
{"$rows_left_out":50}