{"text_format":"1","workbook":"xlsx","n_sheets":4,"sheets":["Interfaz","Poblacion","etapas y mredes","Pobla_EESS"],"not_rendered":{"charts":1,"images":13,"macros":1,"external_links":1,"defined_names":4,"comments":0,"pivot_tables":0},"unopened":[],"bounds":{"document_bytes":16777216,"sheet_cells":100000,"rows_first":2000,"rows_last":500,"rows_between":2000,"halvings":0,"cell_chars":16384,"cell_head_chars":4096},"cells_cut":0,"cells_raw":0,"read":"whole","date_system":"1900"}

{"sheet":"Interfaz","index":0,"n_rows":27,"n_cols":18,"rows_kept":27,"cut":false,"hidden":false,"merged":[[4,2,7,11],[9,2,11,11]]}
[]
[]
[]
[]
[null,null,"POBLACIÓN ASIGNADA SEGÚN CENSOS INEI - RENIEC - PN - CNV - 2023"]
[]
[]
[]
[]
[null,null,"RED INTEGRADA DE SALUD HUAURA OYÓN "]
[]
[]
[]
[]
[]
[]
[]
[]
[]
[]
{"$rows_left_out":8}
{"sheet":"Poblacion","index":1,"n_rows":93,"n_cols":132,"rows_kept":93,"cut":false,"hidden":false,"merged":[[5,64,5,65],[5,48,5,49],[5,56,5,57],[5,66,5,67],[5,62,5,63],[5,46,5,47],[5,40,5,41],[4,42,4,43],[4,44,4,45],[5,42,5,43],[5,44,5,45],[5,24,5,25],[5,26,5,27],[4,16,4,17],[5,16,5,17],[4,38,4,39],[5,38,5,39],[4,5,6,5],[4,66,4,67],[5,12,5,13],[4,14,4,15],[5,14,5,15],[5,58,5,59],[5,36,5,37],[4,28,4,29],[5,32,5,33],[5,34,5,35],[5,28,5,29],[5,30,5,31],[5,54,5,55],[4,60,4,61],[5,60,5,61],[4,62,4,63],[4,7,6,7],[4,8,6,8],[5,50,5,51],[4,52,4,53],[5,52,5,53],[4,10,4,11],[5,10,5,11],[4,12,4,13],[4,18,4,19],[4,20,4,21],[4,22,4,23],[4,24,4,25],[4,26,4,27],[5,18,5,19],[5,20,5,21],[5,22,5,23],[1,30,1,65],[2,30,2,65],[4,58,4,59],[4,48,4,49],[3,30,3,65],[4,36,4,37],[4,56,4,57],[4,30,4,31],[4,32,4,33],[4,34,4,35],[4,50,4,51],[4,54,4,55],[4,64,4,65],[4,40,4,41],[4,46,4,47],[4,74,4,75],[5,74,5,75],[4,89,6,89],[4,88,6,88],[4,83,5,85],[4,86,6,86],[5,77,5,78],[5,79,5,80],[5,68,5,69],[5,70,5,71],[5,72,5,73],[4,72,4,73],[4,70,4,71],[4,68,4,69],[5,76,6,76],[4,76,4,80],[4,81,6,81],[4,82,6,82],[2,93,2,100],[4,98,6,98],[4,97,6,97],[4,91,6,91],[4,92,6,92],[4,93,6,93],[4,95,6,95],[4,94,6,94],[4,90,6,90],[4,99,6,99]]}
[null,null,1,2,3,4,5,6,7,8,9,10,11,12,13,14,15,16,17,18,19,20,21,22,23,24,25,26,27,28,29,30,31,32,33,34,35,36,37,38,39,40,41,42,43,44,45,46,47,48,49,50,51,52,53,54,55,56,57,58,59,60,61,62,63,64,65,66,67,68,69,70,71,72,73,74,75,76,77,78,79,80,81,82,83,84,85,86,87,88,89,90,91,92,93,94,95,96,97,98,null,null,null,77,78,79,80,81,82,83,84,85,86,87,88,89,90,91,92,93,94,95,96,97,98,99,106,107,108,109,110,111]
[null,null,null,null,null,null,null,null,null,null,null,null,null,null,null,null,null,null,null,null,null,null,null,null,null,null,null,null,null,null,"POBLACIÓN ESTIMADA POR GRUPOS DE EDAD, SEGÚN PROVINCIAS DISTRITOS Y ESTABLECIMIENTOS DE SALUD"]
[null,null,null,null,null,null,null,null,null,null,null,null,null,null,null,null,null,null,null,null,null,null,null,null,null,null,null,null,null,null,"RED INTEGRADA DE SALUD HUAURA OYON   -   AÑO  2023",null,null,null,null,null,null,null,null,null,null,null,null,null,null,null,null,null,null,null,null,null,null,null,null,null,null,null,null,null,null,null,null,null,null,null,null,null,null,null,null,null,null,null,null,null,null,null,null,null,null,null,null,null,null,null,null,null,null,null,null,null,null,"MAS GRUPOS DE EDAD"]
[null,null,null,null,null,null,null,null,null,null,null,null,null,null,null,null,null,null,null,null,null,null,null,null,null,null,null,null,null,null,"EDADES PUNTUALES Y GRUPOS DE EDAD"]
[null,null,"N°",null,"DIRECCION DE SALUD","TOTAL GENERAL",null,"TOTAL MASCULINO","TOTAL FEMENINO",null,"EDAD",null,"EDAD",null,"EDAD",null,"EDAD",null,"EDAD",null,"EDAD",null,"EDAD",null,"EDAD",null,"EDAD",null,"EDAD",null,"EDAD",null,"EDAD",null,"EDAD",null,"EDAD",null,"EDAD",null,"EDAD",null,"EDAD",null,"EDAD",null,"EDAD",null,"EDAD",null,"EDAD",null,"EDAD",null,"EDAD",null,"EDAD",null,"EDAD",null,"EDAD",null,"EDAD",null,"EDAD",null,"EDAD",null,"EDAD",null,"EDAD",null,"EDAD",null,"EDAD",null,"EDADES ESPECIALES",null,null,null,null,"NACIMIENTOS","POBLACION FEMENINA TOTAL","POBLACION FEMENINA",null,null,"GESTANTES  ESPERADAS",null,"menor de 1 Año","Pre escolar         (1-4)","Niño             (0 - 11)","Escolar               (05 - 17)","Adolescente (12 - 17)","Adulto Joven (18 - 29)","Adulto            (30-59)","Adu.Mayor (60 a MAS)",null,"Escolar               (05 - 09)","Adolescente (10 - 19)","Adulto            (20-59)"]
["UBIGEO",null,null,null,"PROVINCIA",null,null,null,null,null,0,null,1,null,2,null,3,null,4,null,5,null,6,null,7,null,8,null,9,null,10,null,11,null,12,null,13,null,14,null,15,null,16,null,17,null,18,null,19,null,"20 - 24",null,"25 - 29",null,"30 - 34",null,"35 - 39",null,"40 - 44 ",null,"45 - 49",null,"50 - 54 ",null,"55 - 59 ",null,"60 - 64",null,"65 - 69 ",null,"70- 74 ",null,"75 - 79 ",null,"80 - +",null,"28 DIAS","0-5 MESES",null,"6-11 MESES"]
[null,"Microredes",null,"RENAES","DISTRITO",null,null,null,null,null,"M","F","M","F","M","F","M","F","M","F","M","F","M","F","M","F","M","F","M","F","M","F","M","F","M","F","M","F","M","F","M","F","M","F","M","F","M","F","M","F","M","F","M","F","M","F","M","F","M","F","M","F","M","F","M","F","M","F","M","F","M","F","M","F","M","F",null,"M","F","M","F",null,null," 10 - 14","15 - 19","20 - 49"]
[150000,null,1,null,"HUAURA - OYON",270075,null,134621,135454,null,1808,1781,1825,1802,2052,1947,2104,1974,2051,2010,1752,1753,2368,2310,2444,2296,2378,2372,2323,2282,2316,2119,2316,2210,2465,2283,2337,2280,2207,2099,2201,2209,2160,2103,2074,2040,2098,1980,1974,1974,10034,9877,11321,11624,10321,10713,9904,10099,9070,9073,8326,8456,7342,7448,6335,6545,5323,5377,4323,4482,3402,3478,2457,2648,3210,3810,181,834,793,974,988,4436,0,10991,10306,59842,6953,null,{"$f":"SUM(K8:L8)","v":3589},{"$f":"SUM(M8:T8)","v":15765},{"$f":"SUM(K8:AH8)","v":50593},{"$f":"SUM(U8:AT8)","v":57697},{"$f":"SUM(AI8:AT8)","v":26458},{"$f":"SUM(AU8:BB8)","v":50882},{"$f":"SUM(BC8:BN8)","v":103632},{"$f":"SUM(BO8:BX8)","v":38510},null,{"$f":"SUM(U8:AD8)","v":22278},{"$f":"SUM(AE8:AX8)","v":43445},{"$f":"SUM(AY8:BN8)","v":146488}]
[150800,null,2,150800,"PROVINCIA HUAURA",252635,null,125998,126637,null,1695,1667,1726,1694,1923,1834,1965,1851,1930,1865,1624,1657,2221,2171,2295,2146,2242,2205,2159,2119,2142,1948,2138,2037,2283,2083,2141,2088,2046,1930,2014,2014,1986,1903,1905,1882,1939,1834,1838,1840,9379,9225,10652,10937,9731,10059,9313,9478,8567,8604,7817,7983,6882,6986,5950,6146,4970,5037,4049,4207,3181,3261,2303,2457,2992,3489,166,778,736,917,931,4155,0,10086,9473,56286,6530,null,{"$f":"SUM(K9:L9)","v":3362},{"$f":"SUM(M9:T9)","v":14788},{"$f":"SUM(K9:AH9)","v":47254},{"$f":"SUM(U9:AT9)","v":53379},{"$f":"SUM(AI9:AT9)","v":24275},{"$f":"SUM(AU9:BB9)","v":47644},{"$f":"SUM(BC9:BN9)","v":97516},{"$f":"SUM(BO9:BX9)","v":35946},null,20839,39991,137709]
[150801,null,3,150802,"DISTRITO HUACHO",72821,null,35513,37308,null,360,357,345,337,423,401,488,448,457,460,340,408,587,596,616,556,612,637,593,611,581,542,582,533,566,561,562,568,523,520,531,550,532,522,516,513,559,493,499,490,2525,2477,2764,3029,2592,2826,2614,2691,2496,2608,2340,2489,2168,2292,1905,2077,1633,1791,1383,1518,1052,1226,737,868,1032,1313,27,175,172,185,185,886,0,2724,2568,16120,1412,null,717,3359,11870,14258,6464,12836,29098,12553,null,5556,10743,39893]
[null,"00",4,7639,"HOSPITAL HUACHO",52435,null,25572,26863,null,259,257,248,243,305,289,351,323,329,331,245,294,423,429,444,400,441,459,427,440,418,390,419,384,408,404,405,409,377,374,382,396,383,376,372,369,402,355,359,353,1818,1783,1990,2181,1866,2035,1882,1938,1797,1878,1685,1792,1561,1650,1372,1495,1176,1290,996,1093,757,883,531,625,744,945,19,126,124,133,133,638,null,1961,1849,11607,1017,null,516,2419,8548,10268,4655,9241,20951,9040,null,4002,7735,28723]
[null,"02",5,5679,"C.S. MANZANARES",20386,null,9941,10445,null,101,100,97,94,118,112,137,125,128,129,95,114,164,167,172,156,171,178,166,171,163,152,163,149,158,157,157,159,146,146,149,154,149,146,144,144,157,138,140,137,707,694,774,848,726,791,732,753,699,730,655,697,607,642,533,582,457,501,387,425,295,343,206,243,288,368,8,49,48,52,52,248,null,763,719,4513,395,null,201,940,3322,3990,1809,3595,8147,3513,null,1554,3008,11170]
[150802,null,6,150802,"DISTRITO AMBAR",2049,null,1090,959,null,17,28,26,29,18,11,27,22,16,18,17,19,14,10,17,9,20,13,18,12,13,11,16,15,23,13,15,14,15,16,12,16,15,8,14,15,18,11,17,17,87,72,80,80,60,67,74,81,64,49,67,55,54,51,58,38,43,40,49,40,37,23,38,13,31,43,2,9,10,8,18,65,0,69,67,404,103,null,45,167,416,380,176,382,718,357,null,149,294,1037]
[null,"01",7,5680,"C.S. AMBAR",1235,null,660,575,null,11,17,15,17,11,7,17,13,10,11,11,11,9,6,10,5,12,8,11,7,8,7,10,9,14,8,9,8,9,9,8,9,9,5,9,9,11,7,10,10,52,43,48,48,36,40,45,48,39,29,40,33,33,31,35,23,26,24,29,24,22,14,22,8,19,27,2,6,6,5,11,38,null,41,40,241,61,null,28,101,253,230,106,229,432,215,null,90,178,623]
[null,"01",8,5681,"P.S. AYNACA",814,null,430,384,null,6,11,11,12,7,4,10,9,6,7,6,8,5,4,7,4,8,5,7,5,5,4,6,6,9,5,6,6,6,7,4,7,6,3,5,6,7,4,7,7,35,29,32,32,24,27,29,33,25,20,27,22,21,20,23,15,17,16,20,16,15,9,16,5,12,16,0,3,4,3,7,27,null,28,27,163,42,null,17,66,163,150,70,153,286,142,null,59,116,414]
[150803,null,9,150803,"DISTRITO CARQUIN",9116,null,4596,4520,null,47,55,47,36,54,44,48,54,43,58,51,48,74,75,93,73,85,82,77,82,76,73,96,82,86,75,99,88,74,83,86,76,93,88,69,72,55,60,58,65,354,341,374,356,357,385,371,343,331,354,301,288,241,239,229,230,189,162,131,150,127,117,78,84,102,102,5,19,26,28,29,123,0,401,361,2067,173,null,102,384,1553,2056,989,1663,3669,1242,null,740,1554,5094]
[null,"02",10,5664,"P.S. CARQUIN",9116,null,4596,4520,null,47,55,47,36,54,44,48,54,43,58,51,48,74,75,93,73,85,82,77,82,76,73,96,82,86,75,99,88,74,83,86,76,93,88,69,72,55,60,58,65,354,341,374,356,357,385,371,343,331,354,301,288,241,239,229,230,189,162,131,150,127,117,78,84,102,102,5,19,26,28,29,123,null,401,361,2067,173,null,102,384,1553,2056,989,1663,3669,1242,null,740,1554,5094]
[150804,null,11,150804,"DISTRITO CHECRAS",847,null,420,427,null,3,3,6,7,4,2,4,3,2,7,4,4,3,4,8,3,3,4,7,2,3,4,6,6,5,10,11,3,5,6,7,7,17,10,10,7,4,8,7,1,18,28,30,24,16,20,18,22,23,14,22,14,24,29,31,26,23,22,26,27,23,26,12,20,35,54,0,0,2,3,1,11,0,29,33,122,22,null,6,35,102,159,98,120,259,268,null,42,137,359]
[null,"05",12,5663,"P.S. PUÑUN",847,null,420,427,null,3,3,6,7,4,2,4,3,2,7,4,4,3,4,8,3,3,4,7,2,3,4,6,6,5,10,11,3,5,6,7,7,17,10,10,7,4,8,7,1,18,28,30,24,16,20,18,22,23,14,22,14,24,29,31,26,23,22,26,27,23,26,12,20,35,54,0,0,2,3,1,11,null,29,33,122,22,null,6,35,102,159,98,120,259,268,null,42,137,359]
[150805,null,13,150805,"DISTRITO HUALMAY",29453,null,14548,14905,null,187,189,181,179,207,189,220,220,224,231,204,203,239,240,272,276,278,250,256,265,250,224,229,225,264,241,252,252,227,243,222,234,208,217,228,215,242,213,179,214,1118,1110,1244,1308,1158,1139,1089,1180,996,1033,978,984,854,786,689,710,540,551,437,501,335,361,254,314,287,408,16,90,76,97,113,457,0,1185,1093,6754,617,null,376,1651,5438,6214,2803,5628,11596,3988,null,2483,4579,16376]
{"$rows_left_out":74}
{"sheet":"etapas y mredes","index":2,"n_rows":38,"n_cols":21,"rows_kept":38,"cut":false,"hidden":false,"merged":[[6,15,6,20],[6,2,6,11],[1,2,5,12],[36,2,36,3],[35,2,35,3],[34,2,34,3],[33,2,33,3],[32,2,32,3],[31,2,31,3],[30,2,30,3],[29,2,29,3],[28,2,28,3],[27,2,27,3],[26,2,26,3],[25,2,25,3],[36,4,36,5],[35,4,35,5],[34,4,34,5],[33,4,33,5],[32,4,32,5],[31,4,31,5],[25,4,25,5],[30,4,30,5],[29,4,29,5],[28,4,28,5],[27,4,27,5],[26,4,26,5]]}
[]
[null,null,"POBLACION ASIGNADA POR DISTRITO SIERRA, HOSPITAL, MICROREDES Y POR ETAPAS DE VIDA 2023"]
[]
[]
[]
[]
[null,null,"DISTRITO",null,null,null,null,null,null,null,null,null,null,null,null,"MICROREDES"]
[null,null,65,67,11,74,60,28,76,33,null,null,null,4,null,82,83,84,85,86]
[null,"POBLACION POR\nETAPAS DE VIDA","Andajes","Caujul","Checras","Naván","Oyón","Paccho","Pachangara","Santa Leonor","TOTAL","PORC. (%)",null,"HOSPITAL HUACHO",null,"HUAURA","HUALMAY","SAYAN","VEGUETA","CHURIN OYON","Total Microredes"]
[75,"Neonatal (0-28dias)",{"$f":"VLOOKUP(C$8,Poblacion!$C$8:$CV$93,$A10)","v":0},{"$f":"VLOOKUP(D$8,Poblacion!$C$8:$CV$93,$A10)","v":1},{"$f":"VLOOKUP(E$8,Poblacion!$C$8:$CV$93,$A10)","v":0},{"$f":"VLOOKUP(F$8,Poblacion!$C$8:$CV$93,$A10)","v":0},{"$f":"VLOOKUP(G$8,Poblacion!$C$8:$CV$93,$A10)","v":9},{"$f":"VLOOKUP(H$8,Poblacion!$C$8:$CV$93,$A10)","v":1},{"$f":"VLOOKUP(I$8,Poblacion!$C$8:$CV$93,$A10)","v":2},{"$f":"VLOOKUP(J$8,Poblacion!$C$8:$CV$93,$A10)","v":1},{"$f":"SUM(C10:J10)","v":14},{"$f":"IFERROR((K10/$K$20)*100,0)","v":8.6446434084594015E-2},null,{"$f":"VLOOKUP(N$8,Poblacion!$C$8:$CV$93,$A10)","v":19},null,{"$f":"VLOOKUP(P$8,Poblacion!$C$8:$CV$93,$A10)","v":33},{"$f":"VLOOKUP(Q$8,Poblacion!$C$8:$CV$93,$A10)","v":61},{"$f":"VLOOKUP(R$8,Poblacion!$C$8:$CV$93,$A10)","v":25},{"$f":"VLOOKUP(S$8,Poblacion!$C$8:$CV$93,$A10)","v":28},{"$f":"VLOOKUP(T$8,Poblacion!$C$8:$CV$93,$A10)","v":15},{"$f":"SUM(P10:T10)","v":162}]
[87,"Infantil (Men.1año)",{"$f":"VLOOKUP(C$8,Poblacion!$C$8:$CV$93,$A11)","v":8},{"$f":"VLOOKUP(D$8,Poblacion!$C$8:$CV$93,$A11)","v":10},{"$f":"VLOOKUP(E$8,Poblacion!$C$8:$CV$93,$A11)","v":6},{"$f":"VLOOKUP(F$8,Poblacion!$C$8:$CV$93,$A11)","v":5},{"$f":"VLOOKUP(G$8,Poblacion!$C$8:$CV$93,$A11)","v":101},{"$f":"VLOOKUP(H$8,Poblacion!$C$8:$CV$93,$A11)","v":7},{"$f":"VLOOKUP(I$8,Poblacion!$C$8:$CV$93,$A11)","v":44},{"$f":"VLOOKUP(J$8,Poblacion!$C$8:$CV$93,$A11)","v":7},{"$f":"SUM(C11:J11)","v":188},{"$f":"IFERROR((K11/$K$20)*100,0)","v":1.1608521148502624},null,{"$f":"VLOOKUP(N$8,Poblacion!$C$8:$CV$93,$A11)","v":516},null,{"$f":"VLOOKUP(P$8,Poblacion!$C$8:$CV$93,$A11)","v":548},{"$f":"VLOOKUP(Q$8,Poblacion!$C$8:$CV$93,$A11)","v":1304},{"$f":"VLOOKUP(R$8,Poblacion!$C$8:$CV$93,$A11)","v":459},{"$f":"VLOOKUP(S$8,Poblacion!$C$8:$CV$93,$A11)","v":546},{"$f":"VLOOKUP(T$8,Poblacion!$C$8:$CV$93,$A11)","v":216},{"$f":"SUM(P11:T11)","v":3073}]
[88,"Pre-escolar (01-04años)",{"$f":"VLOOKUP(C$8,Poblacion!$C$8:$CV$93,$A12)","v":23},{"$f":"VLOOKUP(D$8,Poblacion!$C$8:$CV$93,$A12)","v":26},{"$f":"VLOOKUP(E$8,Poblacion!$C$8:$CV$93,$A12)","v":35},{"$f":"VLOOKUP(F$8,Poblacion!$C$8:$CV$93,$A12)","v":32},{"$f":"VLOOKUP(G$8,Poblacion!$C$8:$CV$93,$A12)","v":453},{"$f":"VLOOKUP(H$8,Poblacion!$C$8:$CV$93,$A12)","v":69},{"$f":"VLOOKUP(I$8,Poblacion!$C$8:$CV$93,$A12)","v":192},{"$f":"VLOOKUP(J$8,Poblacion!$C$8:$CV$93,$A12)","v":53},883,5.4523000926211793,null,{"$f":"VLOOKUP(N$8,Poblacion!$C$8:$CV$93,$A12)","v":2419},null,{"$f":"VLOOKUP(P$8,Poblacion!$C$8:$CV$93,$A12)","v":2459},{"$f":"VLOOKUP(Q$8,Poblacion!$C$8:$CV$93,$A12)","v":5717},{"$f":"VLOOKUP(R$8,Poblacion!$C$8:$CV$93,$A12)","v":1854},{"$f":"VLOOKUP(S$8,Poblacion!$C$8:$CV$93,$A12)","v":2282},{"$f":"VLOOKUP(T$8,Poblacion!$C$8:$CV$93,$A12)","v":1034},13346]
[89,"Niño (0-11años)",{"$f":"VLOOKUP(C$8,Poblacion!$C$8:$CV$93,$A13)","v":66},{"$f":"VLOOKUP(D$8,Poblacion!$C$8:$CV$93,$A13)","v":76},{"$f":"VLOOKUP(E$8,Poblacion!$C$8:$CV$93,$A13)","v":102},{"$f":"VLOOKUP(F$8,Poblacion!$C$8:$CV$93,$A13)","v":93},{"$f":"VLOOKUP(G$8,Poblacion!$C$8:$CV$93,$A13)","v":1903},{"$f":"VLOOKUP(H$8,Poblacion!$C$8:$CV$93,$A13)","v":197},{"$f":"VLOOKUP(I$8,Poblacion!$C$8:$CV$93,$A13)","v":402},{"$f":"VLOOKUP(J$8,Poblacion!$C$8:$CV$93,$A13)","v":127},2966,18.314294535350417,null,{"$f":"VLOOKUP(N$8,Poblacion!$C$8:$CV$93,$A13)","v":8548},null,{"$f":"VLOOKUP(P$8,Poblacion!$C$8:$CV$93,$A13)","v":7784},{"$f":"VLOOKUP(Q$8,Poblacion!$C$8:$CV$93,$A13)","v":18438},{"$f":"VLOOKUP(R$8,Poblacion!$C$8:$CV$93,$A13)","v":5795},{"$f":"VLOOKUP(S$8,Poblacion!$C$8:$CV$93,$A13)","v":6572},{"$f":"VLOOKUP(T$8,Poblacion!$C$8:$CV$93,$A13)","v":3456},42045]
[90,"Escolar  (05-17años)",{"$f":"VLOOKUP(C$8,Poblacion!$C$8:$CV$93,$A14)","v":67},{"$f":"VLOOKUP(D$8,Poblacion!$C$8:$CV$93,$A14)","v":84},{"$f":"VLOOKUP(E$8,Poblacion!$C$8:$CV$93,$A14)","v":159},{"$f":"VLOOKUP(F$8,Poblacion!$C$8:$CV$93,$A14)","v":142},{"$f":"VLOOKUP(G$8,Poblacion!$C$8:$CV$93,$A14)","v":2680},{"$f":"VLOOKUP(H$8,Poblacion!$C$8:$CV$93,$A14)","v":234},{"$f":"VLOOKUP(I$8,Poblacion!$C$8:$CV$93,$A14)","v":332},{"$f":"VLOOKUP(J$8,Poblacion!$C$8:$CV$93,$A14)","v":135},3833,23.66779870330349,null,{"$f":"VLOOKUP(N$8,Poblacion!$C$8:$CV$93,$A14)","v":10268},null,{"$f":"VLOOKUP(P$8,Poblacion!$C$8:$CV$93,$A14)","v":8715},{"$f":"VLOOKUP(Q$8,Poblacion!$C$8:$CV$93,$A14)","v":20957},{"$f":"VLOOKUP(R$8,Poblacion!$C$8:$CV$93,$A14)","v":6514},{"$f":"VLOOKUP(S$8,Poblacion!$C$8:$CV$93,$A14)","v":6784},{"$f":"VLOOKUP(T$8,Poblacion!$C$8:$CV$93,$A14)","v":4459},47429]
[91,"Adolescente (12-17años)",{"$f":"VLOOKUP(C$8,Poblacion!$C$8:$CV$93,$A15)","v":32},{"$f":"VLOOKUP(D$8,Poblacion!$C$8:$CV$93,$A15)","v":44},{"$f":"VLOOKUP(E$8,Poblacion!$C$8:$CV$93,$A15)","v":98},{"$f":"VLOOKUP(F$8,Poblacion!$C$8:$CV$93,$A15)","v":86},{"$f":"VLOOKUP(G$8,Poblacion!$C$8:$CV$93,$A15)","v":1331},{"$f":"VLOOKUP(H$8,Poblacion!$C$8:$CV$93,$A15)","v":113},{"$f":"VLOOKUP(I$8,Poblacion!$C$8:$CV$93,$A15)","v":166},{"$f":"VLOOKUP(J$8,Poblacion!$C$8:$CV$93,$A15)","v":68},1938,11.966656375424515,null,{"$f":"VLOOKUP(N$8,Poblacion!$C$8:$CV$93,$A15)","v":4655},null,{"$f":"VLOOKUP(P$8,Poblacion!$C$8:$CV$93,$A15)","v":3938},{"$f":"VLOOKUP(Q$8,Poblacion!$C$8:$CV$93,$A15)","v":9540},{"$f":"VLOOKUP(R$8,Poblacion!$C$8:$CV$93,$A15)","v":3032},{"$f":"VLOOKUP(S$8,Poblacion!$C$8:$CV$93,$A15)","v":3040},{"$f":"VLOOKUP(T$8,Poblacion!$C$8:$CV$93,$A15)","v":2253},21803]
[92,"Adulto Joven (18-29años)",{"$f":"VLOOKUP(C$8,Poblacion!$C$8:$CV$93,$A16)","v":34},{"$f":"VLOOKUP(D$8,Poblacion!$C$8:$CV$93,$A16)","v":79},{"$f":"VLOOKUP(E$8,Poblacion!$C$8:$CV$93,$A16)","v":120},{"$f":"VLOOKUP(F$8,Poblacion!$C$8:$CV$93,$A16)","v":111},{"$f":"VLOOKUP(G$8,Poblacion!$C$8:$CV$93,$A16)","v":1880},{"$f":"VLOOKUP(H$8,Poblacion!$C$8:$CV$93,$A16)","v":205},{"$f":"VLOOKUP(I$8,Poblacion!$C$8:$CV$93,$A16)","v":282},{"$f":"VLOOKUP(J$8,Poblacion!$C$8:$CV$93,$A16)","v":121},2832,17.486878666255016,null,{"$f":"VLOOKUP(N$8,Poblacion!$C$8:$CV$93,$A16)","v":9241},null,{"$f":"VLOOKUP(P$8,Poblacion!$C$8:$CV$93,$A16)","v":7892},{"$f":"VLOOKUP(Q$8,Poblacion!$C$8:$CV$93,$A16)","v":18943},{"$f":"VLOOKUP(R$8,Poblacion!$C$8:$CV$93,$A16)","v":5815},{"$f":"VLOOKUP(S$8,Poblacion!$C$8:$CV$93,$A16)","v":5691},{"$f":"VLOOKUP(T$8,Poblacion!$C$8:$CV$93,$A16)","v":3300},41641]
[93,"Adulto    (30-59años)",{"$f":"VLOOKUP(C$8,Poblacion!$C$8:$CV$93,$A17)","v":117},{"$f":"VLOOKUP(D$8,Poblacion!$C$8:$CV$93,$A17)","v":164},{"$f":"VLOOKUP(E$8,Poblacion!$C$8:$CV$93,$A17)","v":259},{"$f":"VLOOKUP(F$8,Poblacion!$C$8:$CV$93,$A17)","v":313},{"$f":"VLOOKUP(G$8,Poblacion!$C$8:$CV$93,$A17)","v":3379},{"$f":"VLOOKUP(H$8,Poblacion!$C$8:$CV$93,$A17)","v":519},{"$f":"VLOOKUP(I$8,Poblacion!$C$8:$CV$93,$A17)","v":594},{"$f":"VLOOKUP(J$8,Poblacion!$C$8:$CV$93,$A17)","v":281},5626,34.739117011423275,null,{"$f":"VLOOKUP(N$8,Poblacion!$C$8:$CV$93,$A17)","v":20951},null,{"$f":"VLOOKUP(P$8,Poblacion!$C$8:$CV$93,$A17)","v":15640},{"$f":"VLOOKUP(Q$8,Poblacion!$C$8:$CV$93,$A17)","v":38649},{"$f":"VLOOKUP(R$8,Poblacion!$C$8:$CV$93,$A17)","v":10987},{"$f":"VLOOKUP(S$8,Poblacion!$C$8:$CV$93,$A17)","v":10909},{"$f":"VLOOKUP(T$8,Poblacion!$C$8:$CV$93,$A17)","v":6496},82681]
[94,"Adu.Mayor (60 a MAS)",{"$f":"VLOOKUP(C$8,Poblacion!$C$8:$CV$93,$A18)","v":194},{"$f":"VLOOKUP(D$8,Poblacion!$C$8:$CV$93,$A18)","v":112},{"$f":"VLOOKUP(E$8,Poblacion!$C$8:$CV$93,$A18)","v":268},{"$f":"VLOOKUP(F$8,Poblacion!$C$8:$CV$93,$A18)","v":179},{"$f":"VLOOKUP(G$8,Poblacion!$C$8:$CV$93,$A18)","v":1122},{"$f":"VLOOKUP(H$8,Poblacion!$C$8:$CV$93,$A18)","v":432},{"$f":"VLOOKUP(I$8,Poblacion!$C$8:$CV$93,$A18)","v":318},{"$f":"VLOOKUP(J$8,Poblacion!$C$8:$CV$93,$A18)","v":208},2833,17.493053411546775,null,{"$f":"VLOOKUP(N$8,Poblacion!$C$8:$CV$93,$A18)","v":9040},null,{"$f":"VLOOKUP(P$8,Poblacion!$C$8:$CV$93,$A18)","v":4993},{"$f":"VLOOKUP(Q$8,Poblacion!$C$8:$CV$93,$A18)","v":14252},{"$f":"VLOOKUP(R$8,Poblacion!$C$8:$CV$93,$A18)","v":3757},{"$f":"VLOOKUP(S$8,Poblacion!$C$8:$CV$93,$A18)","v":3319},{"$f":"VLOOKUP(T$8,Poblacion!$C$8:$CV$93,$A18)","v":3149},29470]
[85,"Gestantes",{"$f":"VLOOKUP(C$8,Poblacion!$C$8:$CV$93,$A19)","v":8},{"$f":"VLOOKUP(D$8,Poblacion!$C$8:$CV$93,$A19)","v":17},{"$f":"VLOOKUP(E$8,Poblacion!$C$8:$CV$93,$A19)","v":22},{"$f":"VLOOKUP(F$8,Poblacion!$C$8:$CV$93,$A19)","v":16},{"$f":"VLOOKUP(G$8,Poblacion!$C$8:$CV$93,$A19)","v":175},{"$f":"VLOOKUP(H$8,Poblacion!$C$8:$CV$93,$A19)","v":21},{"$f":"VLOOKUP(I$8,Poblacion!$C$8:$CV$93,$A19)","v":79},{"$f":"VLOOKUP(J$8,Poblacion!$C$8:$CV$93,$A19)","v":15},353,2.1796850879901202,null,{"$f":"VLOOKUP(N$8,Poblacion!$C$8:$CV$93,$A19)","v":1017},null,{"$f":"VLOOKUP(P$8,Poblacion!$C$8:$CV$93,$A19)","v":1019},{"$f":"VLOOKUP(Q$8,Poblacion!$C$8:$CV$93,$A19)","v":2525},{"$f":"VLOOKUP(R$8,Poblacion!$C$8:$CV$93,$A19)","v":798},{"$f":"VLOOKUP(S$8,Poblacion!$C$8:$CV$93,$A19)","v":1167},{"$f":"VLOOKUP(T$8,Poblacion!$C$8:$CV$93,$A19)","v":427},5936]
[null," TOTAL",{"$f":"C13+C15+C16+C17+C18","v":443},{"$f":"D13+D15+D16+D17+D18","v":475},847,782,9615,1466,1762,805,{"$f":"K13+K15+K16+K17+K18","v":16195},{"$f":"IFERROR((K20/$K$20)*100,0)","v":100},null,{"$f":"N13+N15+N16+N17+N18","v":52435},null,40247,99822,29386,29531,18654,217640]
{"$rows_left_out":19}
{"sheet":"Pobla_EESS","index":3,"n_rows":60,"n_cols":16,"rows_kept":60,"cut":false,"hidden":false,"merged":[[50,4,52,4],[51,11,54,11],[54,3,54,5],[55,11,57,11],[58,10,58,12],[1,3,4,10],[7,3,7,8],[7,10,7,15],[15,3,15,4],[25,4,29,4],[25,11,30,11],[30,4,31,4],[23,3,23,8],[23,10,23,15],[31,10,31,12],[39,4,45,4],[39,11,41,11],[42,11,46,11],[46,4,49,4],[9,4,13,4],[9,11,11,11],[12,11,16,11],[16,3,16,5],[19,10,19,12],[32,3,32,5],[37,3,37,8],[37,10,37,15]]}
[]
[null,null,null,"POBLACIÓN SEGÚN DISTRITOS Y EE.SS - 2023"]
[]
[]
[]
[]
[]
[null,null,null,"SIN MICRORED",null,null,null,null,null,null,"MICRORED HUALMAY"]
[null,null,null,"DISTRITO","POBLACIÓN","EE.SS","POBLACIÓN","MASCULINO","FEMENINO",null,"DISTRITO","POBLACIÓN","EE.SS","POBLACIÓN","MASCULINO","FEMENINO"]
[null,null,null,"HUACHO",{"$f":"G10","v":52435},"HOSPITAL HUACHO",{"$f":"VLOOKUP($F10,Poblacion!$E$8:$I$87,2,FALSE)","v":52435},{"$f":"VLOOKUP($F10,Poblacion!$E$8:$I$87,4,FALSE)","v":25572},{"$f":"VLOOKUP($F10,Poblacion!$E$8:$I$87,5,FALSE)","v":26863},null,"HUALMAY",{"$f":"SUM(N10:N12)","v":29453},"C.S. HUALMAY",{"$f":"VLOOKUP($M10,Poblacion!$E$8:$I$87,2,FALSE)","v":14167},{"$f":"VLOOKUP($M10,Poblacion!$E$8:$I$87,4,FALSE)","v":6999},{"$f":"VLOOKUP($M10,Poblacion!$E$8:$I$87,5,FALSE)","v":7168}]
[null,null,null,"HUACHO",null,"CLINICA SAN PEDRO",0,null,null,null,"HUALMAY",null,"P.S. DGO. MANDAMIENTO",{"$f":"VLOOKUP($M11,Poblacion!$E$8:$I$87,2,FALSE)","v":10595},{"$f":"VLOOKUP($M11,Poblacion!$E$8:$I$87,4,FALSE)","v":5231},{"$f":"VLOOKUP($M11,Poblacion!$E$8:$I$87,5,FALSE)","v":5364}]
[null,null,null,"HUACHO",null,"ESSALUD GUSTAVO LA NATA",0,null,null,null,"HUALMAY",null,"P.S. CAMPO ALEGRE",{"$f":"VLOOKUP($M12,Poblacion!$E$8:$I$87,2,FALSE)","v":4691},{"$f":"VLOOKUP($M12,Poblacion!$E$8:$I$87,4,FALSE)","v":2318},{"$f":"VLOOKUP($M12,Poblacion!$E$8:$I$87,5,FALSE)","v":2373}]
[null,null,null,"HUACHO",null,"CLINICA SAN BARTOLOME",0,null,null,null,"S.MARIA",{"$f":"SUM(N13:N17)","v":40867},"C.S. SANTA MARIA",{"$f":"VLOOKUP($M13,Poblacion!$E$8:$I$87,2,FALSE)","v":11442},{"$f":"VLOOKUP($M13,Poblacion!$E$8:$I$87,4,FALSE)","v":5720},{"$f":"VLOOKUP($M13,Poblacion!$E$8:$I$87,5,FALSE)","v":5722}]
[null,null,null,"HUACHO",null,"GOLD ESTANDAR EIRL.",0,null,null,null,"S.MARIA",null,"P.S. CHONTA",{"$f":"VLOOKUP($M14,Poblacion!$E$8:$I$87,2,FALSE)","v":6134},{"$f":"VLOOKUP($M14,Poblacion!$E$8:$I$87,4,FALSE)","v":3069},{"$f":"VLOOKUP($M14,Poblacion!$E$8:$I$87,5,FALSE)","v":3065}]
[null,null,null,"CARQUIN",null,"INSITUTO NACIONAL PENITENCIARIO CARQUIN",0,null,null,null,"S.MARIA",null,"P.S. ZAPATA",{"$f":"VLOOKUP($M15,Poblacion!$E$8:$I$87,2,FALSE)","v":3678},{"$f":"VLOOKUP($M15,Poblacion!$E$8:$I$87,4,FALSE)","v":1840},{"$f":"VLOOKUP($M15,Poblacion!$E$8:$I$87,5,FALSE)","v":1838}]
[null,null,null,null,null,"OTROS ESTABLECIMIENTOS",0,null,null,null,"S.MARIA",null,"P.S. AMADO VELASQUEZ",{"$f":"VLOOKUP($M16,Poblacion!$E$8:$I$87,2,FALSE)","v":12257},{"$f":"VLOOKUP($M16,Poblacion!$E$8:$I$87,4,FALSE)","v":6132},{"$f":"VLOOKUP($M16,Poblacion!$E$8:$I$87,5,FALSE)","v":6125}]
[null,null,null,"TOTAL SIN MICRORED",null,null,{"$f":"SUM(G10:G16)","v":52435},{"$f":"SUM(H10:H16)","v":25572},{"$f":"SUM(I10:I16)","v":26863},null,"S.MARIA",null,"P.S. SAN BARTOLOME",{"$f":"VLOOKUP($M17,Poblacion!$E$8:$I$87,2,FALSE)","v":7356},{"$f":"VLOOKUP($M17,Poblacion!$E$8:$I$87,4,FALSE)","v":3678},{"$f":"VLOOKUP($M17,Poblacion!$E$8:$I$87,5,FALSE)","v":3678}]
[null,null,null,{"$f":"'etapas y mredes'!B21","v":"Elaboración: Área de Estadística - RIS Huaura Oyón."},null,null,null,null,null,null,"CARQUIN",{"$f":"N18","v":9116},"P.S. CARQUIN",{"$f":"VLOOKUP($M18,Poblacion!$E$8:$I$87,2,FALSE)","v":9116},{"$f":"VLOOKUP($M18,Poblacion!$E$8:$I$87,4,FALSE)","v":4596},{"$f":"VLOOKUP($M18,Poblacion!$E$8:$I$87,5,FALSE)","v":4520}]
[null,null,null,null,null,null,null,null,null,null,"HUACHO",{"$f":"N19","v":20386},"C.S. MANZANARES",{"$f":"VLOOKUP($M19,Poblacion!$E$8:$I$87,2,FALSE)","v":20386},{"$f":"VLOOKUP($M19,Poblacion!$E$8:$I$87,4,FALSE)","v":9941},{"$f":"VLOOKUP($M19,Poblacion!$E$8:$I$87,5,FALSE)","v":10445}]
[null,null,null,null,null,null,null,null,null,null,"TOTAL MCR HUALMAY",null,"TOTAL MICRORED HUALMAY",{"$f":"SUM(N10:N19)","v":99822},{"$f":"SUM(O10:O19)","v":49524},{"$f":"SUM(P10:P19)","v":50298}]
{"$rows_left_out":40}