{"text_format":"1","workbook":"xlsx","n_sheets":4,"sheets":["Interfaz","Poblacion","etapas y mredes","Pobla_EESS"],"not_rendered":{"charts":1,"images":13,"macros":1,"external_links":1,"defined_names":4,"comments":0,"pivot_tables":0},"unopened":[],"bounds":{"document_bytes":16777216,"sheet_cells":100000,"rows_first":2000,"rows_last":500,"rows_between":2000,"halvings":0,"cell_chars":16384,"cell_head_chars":4096},"cells_cut":0,"cells_raw":0,"read":"whole","date_system":"1900"}

{"sheet":"Interfaz","index":0,"n_rows":27,"n_cols":18,"rows_kept":27,"cut":false,"hidden":false,"merged":[[4,2,7,11],[9,2,11,11]]}
[]
[]
[]
[]
[null,null,"POBLACIÓN ASIGNADA SEGÚN CENSOS INEI - RENIEC - PN - CNV - 2022"]
[]
[]
[]
[]
[null,null,"RED INTEGRADA DE SALUD HUAURA OYÓN "]
[]
[]
[]
[]
[]
[]
[]
[]
[]
[]
{"$rows_left_out":8}
{"sheet":"Poblacion","index":1,"n_rows":93,"n_cols":132,"rows_kept":93,"cut":false,"hidden":false,"merged":[[5,64,5,65],[5,48,5,49],[5,56,5,57],[5,66,5,67],[5,62,5,63],[5,46,5,47],[5,40,5,41],[4,42,4,43],[4,44,4,45],[5,42,5,43],[5,44,5,45],[5,24,5,25],[5,26,5,27],[4,16,4,17],[5,16,5,17],[4,38,4,39],[5,38,5,39],[4,5,6,5],[4,66,4,67],[5,12,5,13],[4,14,4,15],[5,14,5,15],[5,58,5,59],[5,36,5,37],[4,28,4,29],[5,32,5,33],[5,34,5,35],[5,28,5,29],[5,30,5,31],[5,54,5,55],[4,60,4,61],[5,60,5,61],[4,62,4,63],[4,7,6,7],[4,8,6,8],[5,50,5,51],[4,52,4,53],[5,52,5,53],[4,10,4,11],[5,10,5,11],[4,12,4,13],[4,18,4,19],[4,20,4,21],[4,22,4,23],[4,24,4,25],[4,26,4,27],[5,18,5,19],[5,20,5,21],[5,22,5,23],[1,30,1,65],[2,30,2,65],[4,58,4,59],[4,48,4,49],[3,30,3,65],[4,36,4,37],[4,56,4,57],[4,30,4,31],[4,32,4,33],[4,34,4,35],[4,50,4,51],[4,54,4,55],[4,64,4,65],[4,40,4,41],[4,46,4,47],[4,74,4,75],[5,74,5,75],[4,89,6,89],[4,88,6,88],[4,83,5,85],[4,86,6,86],[5,77,5,78],[5,79,5,80],[5,68,5,69],[5,70,5,71],[5,72,5,73],[4,72,4,73],[4,70,4,71],[4,68,4,69],[5,76,6,76],[4,76,4,80],[4,81,6,81],[4,82,6,82],[2,93,2,100],[4,98,6,98],[4,97,6,97],[4,91,6,91],[4,92,6,92],[4,93,6,93],[4,95,6,95],[4,94,6,94],[4,90,6,90],[4,99,6,99]]}
[null,null,1,2,3,4,5,6,7,8,9,10,11,12,13,14,15,16,17,18,19,20,21,22,23,24,25,26,27,28,29,30,31,32,33,34,35,36,37,38,39,40,41,42,43,44,45,46,47,48,49,50,51,52,53,54,55,56,57,58,59,60,61,62,63,64,65,66,67,68,69,70,71,72,73,74,75,76,77,78,79,80,81,82,83,84,85,86,87,88,89,90,91,92,93,94,95,96,97,98,null,null,null,77,78,79,80,81,82,83,84,85,86,87,88,89,90,91,92,93,94,95,96,97,98,99,106,107,108,109,110,111]
[null,null,null,null,null,null,null,null,null,null,null,null,null,null,null,null,null,null,null,null,null,null,null,null,null,null,null,null,null,null,"POBLACIÓN ESTIMADA POR GRUPOS DE EDAD, SEGÚN PROVINCIAS DISTRITOS Y ESTABLECIMIENTOS DE SALUD"]
[null,null,null,null,null,null,null,null,null,null,null,null,null,null,null,null,null,null,null,null,null,null,null,null,null,null,null,null,null,null,"RED INTEGRADA DE SALUD HUAURA OYON   -   AÑO  2022",null,null,null,null,null,null,null,null,null,null,null,null,null,null,null,null,null,null,null,null,null,null,null,null,null,null,null,null,null,null,null,null,null,null,null,null,null,null,null,null,null,null,null,{"$f":"ROUND(BY3,0)","v":0},null,null,null,null,null,null,null,null,null,null,null,null,null,null,null,null,null,null,"MAS GRUPOS DE EDAD"]
[null,null,null,null,null,null,null,null,null,null,null,null,null,null,null,null,null,null,null,null,null,null,null,null,null,null,null,null,null,null,"EDADES PUNTUALES Y GRUPOS DE EDAD"]
[null,null,"N°",null,"DIRECCION DE SALUD","TOTAL GENERAL",null,"TOTAL MASCULINO","TOTAL FEMENINO",null,"EDAD",null,"EDAD",null,"EDAD",null,"EDAD",null,"EDAD",null,"EDAD",null,"EDAD",null,"EDAD",null,"EDAD",null,"EDAD",null,"EDAD",null,"EDAD",null,"EDAD",null,"EDAD",null,"EDAD",null,"EDAD",null,"EDAD",null,"EDAD",null,"EDAD",null,"EDAD",null,"EDAD",null,"EDAD",null,"EDAD",null,"EDAD",null,"EDAD",null,"EDAD",null,"EDAD",null,"EDAD",null,"EDAD",null,"EDAD",null,"EDAD",null,"EDAD",null,"EDAD",null,"EDADES ESPECIALES",null,null,null,null,"NACIMIENTOS","POBLACION FEMENINA TOTAL","POBLACION FEMENINA",null,null,"GESTANTES  ESPERADAS",null,"menor de 1 Año","Pre escolar         (1-4)","Niño             (0 - 11)","Escolar               (05 - 17)","Adolescente (12 - 17)","Adulto Joven (18 - 29)","Adulto            (30-59)","Adu.Mayor (60 a MAS)",null,"Escolar               (05 - 09)","Adolescente (10 - 19)","Adulto            (20-59)"]
["UBIGEO",null,null,null,"PROVINCIA",null,null,null,null,null,0,null,1,null,2,null,3,null,4,null,5,null,6,null,7,null,8,null,9,null,10,null,11,null,12,null,13,null,14,null,15,null,16,null,17,null,18,null,19,null,"20 - 24",null,"25 - 29",null,"30 - 34",null,"35 - 39",null,"40 - 44 ",null,"45 - 49",null,"50 - 54 ",null,"55 - 59 ",null,"60 - 64",null,"65 - 69 ",null,"70- 74 ",null,"75 - 79 ",null,"80 - +",null,"28 DIAS","0-5 MESES",null,"6-11 MESES"]
[null,"Microredes",null,"RENAES","DISTRITO",null,null,null,null,null,"M","F","M","F","M","F","M","F","M","F","M","F","M","F","M","F","M","F","M","F","M","F","M","F","M","F","M","F","M","F","M","F","M","F","M","F","M","F","M","F","M","F","M","F","M","F","M","F","M","F","M","F","M","F","M","F","M","F","M","F","M","F","M","F","M","F",null,"M","F","M","F",null,null," 10 - 14","15 - 19","20 - 49"]
[150000,null,1,null,"HUAURA - OYON",266778,null,133563,133215,null,1838,1807,2004,1921,2121,1982,2093,2024,1762,1762,1855,1777,2336,2264,2408,2258,2353,2328,2296,2244,2293,2087,2284,2182,2440,2262,2313,2256,2181,2076,2184,2188,2143,2086,2058,2016,2098,1957,1961,1946,9967,9655,11209,11410,10223,10482,9787,9875,8960,8832,8248,8256,7250,7279,6275,6423,5280,5297,4295,4420,3375,3427,2453,2622,3220,3814,230,913,950,925,856,4437,0,10863,10193,58510,6423,null,{"$f":"SUM(K8:L8)","v":3645},{"$f":"SUM(M8:T8)","v":15669},{"$f":"SUM(K8:AH8)","v":50279},{"$f":"SUM(U8:AT8)","v":57168},{"$f":"SUM(AI8:AT8)","v":26203},{"$f":"SUM(AU8:BB8)","v":50203},{"$f":"SUM(BC8:BN8)","v":101890},{"$f":"SUM(BO8:BX8)","v":38203},null,{"$f":"SUM(U8:AD8)","v":22119},{"$f":"SUM(AE8:AX8)","v":43011},{"$f":"SUM(AY8:BN8)","v":144131}]
[150800,null,2,150800,"PROVINCIA HUAURA",247048,null,123709,123339,null,1722,1685,1882,1799,1983,1861,1956,1876,1631,1655,1706,1667,2174,2118,2247,2096,2200,2152,2116,2068,2101,1899,2092,1993,2240,2041,2095,2041,2007,1889,1975,1973,1944,1859,1869,1840,1908,1792,1806,1793,9213,8931,10452,10645,9545,9769,9119,9188,8383,8303,7656,7718,6726,6759,5818,5956,4860,4895,3973,4095,3109,3165,2261,2392,2940,3426,208,855,889,867,796,4147,0,9863,9257,54554,6010,null,{"$f":"SUM(K9:L9)","v":3407},{"$f":"SUM(M9:T9)","v":14643},{"$f":"SUM(K9:AH9)","v":46679},{"$f":"SUM(U9:AT9)","v":52402},{"$f":"SUM(AI9:AT9)","v":23773},{"$f":"SUM(AU9:BB9)","v":46540},{"$f":"SUM(BC9:BN9)","v":94940},{"$f":"SUM(BO9:BX9)","v":35116},null,20544,39157,134181]
[150801,null,3,150802,"DISTRITO HUACHO",69671,null,34129,35542,null,367,336,402,396,498,454,468,446,332,431,413,401,563,568,590,530,587,608,568,583,557,517,558,508,542,535,539,542,501,496,509,525,510,498,495,489,536,465,478,463,2420,2332,2649,2859,2484,2668,2496,2540,2383,2461,2233,2350,2068,2163,1817,1981,1557,1708,1319,1448,1003,1169,703,819,984,1253,32,189,169,178,167,854,0,2598,2440,15210,1261,null,703,3427,11681,13732,6181,12202,27644,11963,null,5411,10263,37904]
[null,"00",4,7639,"HOSPITAL HUACHO",50863,null,24915,25948,null,268,245,293,289,364,331,342,326,242,315,301,293,411,415,431,387,429,444,415,426,407,377,407,371,396,391,393,396,366,362,372,383,372,364,361,357,391,339,349,338,1767,1702,1934,2087,1813,1948,1822,1854,1740,1797,1630,1716,1510,1579,1326,1446,1137,1247,963,1057,732,853,513,598,718,915,24,138,123,130,122,624,null,1897,1781,11104,921,null,513,2502,8529,10027,4513,8907,20181,8733,null,3952,7492,27671]
[null,"02",5,5679,"C.S. MANZANARES",18808,null,9214,9594,null,99,91,109,107,134,123,126,120,90,116,112,108,152,153,159,143,158,164,153,157,150,140,151,137,146,144,146,146,135,134,137,142,138,134,134,132,145,126,129,125,653,630,715,772,671,720,674,686,643,664,603,634,558,584,491,535,420,461,356,391,271,316,190,221,266,338,8,51,46,48,45,230,null,701,659,4106,340,null,190,925,3152,3705,1668,3295,7463,3230,null,1459,2771,10233]
[150802,null,6,150802,"DISTRITO AMBAR",2620,null,1391,1229,null,26,29,19,14,26,20,21,19,15,15,21,20,18,13,22,12,26,17,23,16,17,15,21,20,30,17,20,19,20,22,16,22,19,11,18,20,24,15,22,23,114,95,104,108,78,89,96,109,83,65,88,72,71,67,76,51,56,54,64,54,48,31,49,18,40,57,2,12,18,14,11,63,0,93,91,538,89,null,55,149,465,495,234,505,945,471,null,188,391,1366]
[null,"01",7,5680,"C.S. AMBAR",1576,null,837,739,null,16,17,11,8,16,12,13,11,9,9,13,12,11,8,13,7,16,10,14,10,10,9,13,12,18,10,12,11,12,13,10,13,11,7,11,12,14,9,13,14,68,57,62,65,47,53,58,65,50,39,53,43,43,41,46,31,34,33,38,33,29,19,29,11,24,35,2,7,11,8,7,38,null,55,55,322,53,null,33,89,280,298,140,302,569,285,null,114,234,821]
[null,"01",8,5681,"P.S. AYNACA",1044,null,554,490,null,10,12,8,6,10,8,8,8,6,6,8,8,7,5,9,5,10,7,9,6,7,6,8,8,12,7,8,8,8,9,6,9,8,4,7,8,10,6,9,9,46,38,42,43,31,36,38,44,33,26,35,29,28,26,30,20,22,21,26,21,19,12,20,7,16,22,0,5,7,6,4,25,null,38,36,216,36,null,22,60,185,197,94,203,376,186,null,74,157,545]
[150803,null,9,150803,"DISTRITO CARQUIN",6806,null,3475,3331,null,45,40,53,38,50,60,41,52,56,45,46,64,55,54,69,52,63,59,57,59,56,53,71,59,64,54,73,64,55,60,64,55,69,64,51,52,41,43,43,46,262,244,277,254,264,276,275,248,244,256,222,206,178,171,169,164,139,116,96,107,93,84,58,60,76,72,5,19,27,26,13,103,0,290,260,1484,305,null,85,395,1297,1542,725,1210,2673,901,null,578,1137,3710]
[null,"02",10,5664,"P.S. CARQUIN",6806,null,3475,3331,null,45,40,53,38,50,60,41,52,56,45,46,64,55,54,69,52,63,59,57,59,56,53,71,59,64,54,73,64,55,60,64,55,69,64,51,52,41,43,43,46,262,244,277,254,264,276,275,248,244,256,222,206,178,171,169,164,139,116,96,107,93,84,58,60,76,72,5,19,27,26,13,103,null,290,260,1484,305,null,85,395,1297,1542,725,1210,2673,901,null,578,1137,3710]
[150804,null,11,150804,"DISTRITO CHECRAS",997,null,494,503,null,6,8,4,3,4,4,2,7,4,0,5,5,4,5,10,4,3,5,8,2,3,0,7,7,6,12,13,4,6,7,8,8,20,12,12,8,5,10,8,1,21,34,36,28,19,24,21,26,27,17,26,17,29,35,37,31,27,26,31,33,27,31,14,24,41,65,0,1,4,5,4,17,0,30,39,146,36,null,14,28,110,184,116,143,309,319,null,51,157,428]
[null,"05",12,5663,"P.S. PUÑUN",997,null,494,503,null,6,8,4,3,4,4,2,7,4,0,5,5,4,5,10,4,3,5,8,2,3,0,7,7,6,12,13,4,6,7,8,8,20,12,12,8,5,10,8,1,21,34,36,28,19,24,21,26,27,17,26,17,29,35,37,31,27,26,31,33,27,31,14,24,41,65,0,1,4,5,4,17,null,30,39,146,36,null,14,28,110,184,116,143,309,319,null,51,157,428]
[150805,null,13,150805,"DISTRITO HUALMAY",29514,null,14643,14871,null,183,173,203,193,215,213,228,241,214,198,222,196,240,241,274,277,280,251,258,266,251,225,230,226,266,242,253,253,228,244,223,235,209,218,229,216,243,212,180,213,1125,1101,1251,1312,1165,1131,1095,1184,998,1025,980,976,855,779,690,704,541,546,438,497,335,358,254,315,287,410,18,93,94,90,79,434,0,1190,1094,6729,557,null,356,1705,5498,6253,2816,5637,11582,3981,null,2505,4596,16371]
{"$rows_left_out":74}
{"sheet":"etapas y mredes","index":2,"n_rows":38,"n_cols":21,"rows_kept":38,"cut":false,"hidden":false,"merged":[[6,15,6,20],[6,2,6,11],[1,2,5,12],[36,2,36,3],[35,2,35,3],[34,2,34,3],[33,2,33,3],[32,2,32,3],[31,2,31,3],[30,2,30,3],[29,2,29,3],[28,2,28,3],[27,2,27,3],[26,2,26,3],[25,2,25,3],[36,4,36,5],[35,4,35,5],[34,4,34,5],[33,4,33,5],[32,4,32,5],[31,4,31,5],[25,4,25,5],[30,4,30,5],[29,4,29,5],[28,4,28,5],[27,4,27,5],[26,4,26,5]]}
[]
[null,null,"POBLACION ASIGNADA POR DISTRITO SIERRA, HOSPITAL, MICROREDES Y POR ETAPAS DE VIDA 2022"]
[]
[]
[]
[]
[null,null,"DISTRITO",null,null,null,null,null,null,null,null,null,null,null,null,"MICROREDES"]
[null,null,65,67,11,74,60,28,76,33,null,null,null,4,null,82,83,84,85,86]
[null,"POBLACION POR\nETAPAS DE VIDA","Andajes","Caujul","Checras","Naván","Oyón","Paccho","Pachangara","Santa Leonor","TOTAL","PORC. (%)",null,"HOSPITAL HUACHO",null,"HUAURA","HUALMAY","SAYAN","VEGUETA","CHURIN OYON","Total Microredes"]
[75,"Neonatal (0-28dias)",{"$f":"VLOOKUP(C$8,Poblacion!$C$8:$CV$93,$A10)","v":0},{"$f":"VLOOKUP(D$8,Poblacion!$C$8:$CV$93,$A10)","v":1},{"$f":"VLOOKUP(E$8,Poblacion!$C$8:$CV$93,$A10)","v":0},{"$f":"VLOOKUP(F$8,Poblacion!$C$8:$CV$93,$A10)","v":0},{"$f":"VLOOKUP(G$8,Poblacion!$C$8:$CV$93,$A10)","v":14},{"$f":"VLOOKUP(H$8,Poblacion!$C$8:$CV$93,$A10)","v":1},{"$f":"VLOOKUP(I$8,Poblacion!$C$8:$CV$93,$A10)","v":3},{"$f":"VLOOKUP(J$8,Poblacion!$C$8:$CV$93,$A10)","v":1},{"$f":"SUM(C10:J10)","v":20},{"$f":"IFERROR((K10/$K$20)*100,0)","v":0.11328235627301048},null,{"$f":"VLOOKUP(N$8,Poblacion!$C$8:$CV$93,$A10)","v":24},null,{"$f":"VLOOKUP(P$8,Poblacion!$C$8:$CV$93,$A10)","v":36},{"$f":"VLOOKUP(Q$8,Poblacion!$C$8:$CV$93,$A10)","v":71},{"$f":"VLOOKUP(R$8,Poblacion!$C$8:$CV$93,$A10)","v":36},{"$f":"VLOOKUP(S$8,Poblacion!$C$8:$CV$93,$A10)","v":41},{"$f":"VLOOKUP(T$8,Poblacion!$C$8:$CV$93,$A10)","v":22},{"$f":"SUM(P10:T10)","v":206}]
[87,"Infantil (Men.1año)",{"$f":"VLOOKUP(C$8,Poblacion!$C$8:$CV$93,$A11)","v":6},{"$f":"VLOOKUP(D$8,Poblacion!$C$8:$CV$93,$A11)","v":8},{"$f":"VLOOKUP(E$8,Poblacion!$C$8:$CV$93,$A11)","v":14},{"$f":"VLOOKUP(F$8,Poblacion!$C$8:$CV$93,$A11)","v":10},{"$f":"VLOOKUP(G$8,Poblacion!$C$8:$CV$93,$A11)","v":107},{"$f":"VLOOKUP(H$8,Poblacion!$C$8:$CV$93,$A11)","v":14},{"$f":"VLOOKUP(I$8,Poblacion!$C$8:$CV$93,$A11)","v":42},{"$f":"VLOOKUP(J$8,Poblacion!$C$8:$CV$93,$A11)","v":10},{"$f":"SUM(C11:J11)","v":211},{"$f":"IFERROR((K11/$K$20)*100,0)","v":1.1951288586802606},null,{"$f":"VLOOKUP(N$8,Poblacion!$C$8:$CV$93,$A11)","v":513},null,{"$f":"VLOOKUP(P$8,Poblacion!$C$8:$CV$93,$A11)","v":536},{"$f":"VLOOKUP(Q$8,Poblacion!$C$8:$CV$93,$A11)","v":1311},{"$f":"VLOOKUP(R$8,Poblacion!$C$8:$CV$93,$A11)","v":477},{"$f":"VLOOKUP(S$8,Poblacion!$C$8:$CV$93,$A11)","v":562},{"$f":"VLOOKUP(T$8,Poblacion!$C$8:$CV$93,$A11)","v":246},{"$f":"SUM(P11:T11)","v":3132}]
[88,"Pre-escolar (01-04años)",{"$f":"VLOOKUP(C$8,Poblacion!$C$8:$CV$93,$A12)","v":21},{"$f":"VLOOKUP(D$8,Poblacion!$C$8:$CV$93,$A12)","v":21},{"$f":"VLOOKUP(E$8,Poblacion!$C$8:$CV$93,$A12)","v":28},{"$f":"VLOOKUP(F$8,Poblacion!$C$8:$CV$93,$A12)","v":29},{"$f":"VLOOKUP(G$8,Poblacion!$C$8:$CV$93,$A12)","v":479},{"$f":"VLOOKUP(H$8,Poblacion!$C$8:$CV$93,$A12)","v":81},{"$f":"VLOOKUP(I$8,Poblacion!$C$8:$CV$93,$A12)","v":187},{"$f":"VLOOKUP(J$8,Poblacion!$C$8:$CV$93,$A12)","v":53},899,5.092041914471821,null,{"$f":"VLOOKUP(N$8,Poblacion!$C$8:$CV$93,$A12)","v":2502},null,{"$f":"VLOOKUP(P$8,Poblacion!$C$8:$CV$93,$A12)","v":2442},{"$f":"VLOOKUP(Q$8,Poblacion!$C$8:$CV$93,$A12)","v":5580},{"$f":"VLOOKUP(R$8,Poblacion!$C$8:$CV$93,$A12)","v":1857},{"$f":"VLOOKUP(S$8,Poblacion!$C$8:$CV$93,$A12)","v":2231},{"$f":"VLOOKUP(T$8,Poblacion!$C$8:$CV$93,$A12)","v":1057},13167]
[89,"Niño (0-11años)",{"$f":"VLOOKUP(C$8,Poblacion!$C$8:$CV$93,$A13)","v":72},{"$f":"VLOOKUP(D$8,Poblacion!$C$8:$CV$93,$A13)","v":93},{"$f":"VLOOKUP(E$8,Poblacion!$C$8:$CV$93,$A13)","v":110},{"$f":"VLOOKUP(F$8,Poblacion!$C$8:$CV$93,$A13)","v":109},{"$f":"VLOOKUP(G$8,Poblacion!$C$8:$CV$93,$A13)","v":1873},{"$f":"VLOOKUP(H$8,Poblacion!$C$8:$CV$93,$A13)","v":216},{"$f":"VLOOKUP(I$8,Poblacion!$C$8:$CV$93,$A13)","v":465},{"$f":"VLOOKUP(J$8,Poblacion!$C$8:$CV$93,$A13)","v":159},3097,17.541772868875672,null,{"$f":"VLOOKUP(N$8,Poblacion!$C$8:$CV$93,$A13)","v":8529},null,{"$f":"VLOOKUP(P$8,Poblacion!$C$8:$CV$93,$A13)","v":7869},{"$f":"VLOOKUP(Q$8,Poblacion!$C$8:$CV$93,$A13)","v":17883},{"$f":"VLOOKUP(R$8,Poblacion!$C$8:$CV$93,$A13)","v":6046},{"$f":"VLOOKUP(S$8,Poblacion!$C$8:$CV$93,$A13)","v":6330},{"$f":"VLOOKUP(T$8,Poblacion!$C$8:$CV$93,$A13)","v":3622},41750]
[90,"Escolar  (05-17años)",{"$f":"VLOOKUP(C$8,Poblacion!$C$8:$CV$93,$A14)","v":91},{"$f":"VLOOKUP(D$8,Poblacion!$C$8:$CV$93,$A14)","v":124},{"$f":"VLOOKUP(E$8,Poblacion!$C$8:$CV$93,$A14)","v":184},{"$f":"VLOOKUP(F$8,Poblacion!$C$8:$CV$93,$A14)","v":174},{"$f":"VLOOKUP(G$8,Poblacion!$C$8:$CV$93,$A14)","v":2547},{"$f":"VLOOKUP(H$8,Poblacion!$C$8:$CV$93,$A14)","v":247},{"$f":"VLOOKUP(I$8,Poblacion!$C$8:$CV$93,$A14)","v":490},{"$f":"VLOOKUP(J$8,Poblacion!$C$8:$CV$93,$A14)","v":198},4055,22.967997734352874,null,{"$f":"VLOOKUP(N$8,Poblacion!$C$8:$CV$93,$A14)","v":10027},null,{"$f":"VLOOKUP(P$8,Poblacion!$C$8:$CV$93,$A14)","v":8934},{"$f":"VLOOKUP(Q$8,Poblacion!$C$8:$CV$93,$A14)","v":20097},{"$f":"VLOOKUP(R$8,Poblacion!$C$8:$CV$93,$A14)","v":6974},{"$f":"VLOOKUP(S$8,Poblacion!$C$8:$CV$93,$A14)","v":6415},{"$f":"VLOOKUP(T$8,Poblacion!$C$8:$CV$93,$A14)","v":4721},47141]
[91,"Adolescente (12-17años)",{"$f":"VLOOKUP(C$8,Poblacion!$C$8:$CV$93,$A15)","v":46},{"$f":"VLOOKUP(D$8,Poblacion!$C$8:$CV$93,$A15)","v":60},{"$f":"VLOOKUP(E$8,Poblacion!$C$8:$CV$93,$A15)","v":116},{"$f":"VLOOKUP(F$8,Poblacion!$C$8:$CV$93,$A15)","v":104},{"$f":"VLOOKUP(G$8,Poblacion!$C$8:$CV$93,$A15)","v":1260},{"$f":"VLOOKUP(H$8,Poblacion!$C$8:$CV$93,$A15)","v":126},{"$f":"VLOOKUP(I$8,Poblacion!$C$8:$CV$93,$A15)","v":254},{"$f":"VLOOKUP(J$8,Poblacion!$C$8:$CV$93,$A15)","v":102},2068,11.713395638629283,null,{"$f":"VLOOKUP(N$8,Poblacion!$C$8:$CV$93,$A15)","v":4513},null,{"$f":"VLOOKUP(P$8,Poblacion!$C$8:$CV$93,$A15)","v":4043},{"$f":"VLOOKUP(Q$8,Poblacion!$C$8:$CV$93,$A15)","v":9105},{"$f":"VLOOKUP(R$8,Poblacion!$C$8:$CV$93,$A15)","v":3262},{"$f":"VLOOKUP(S$8,Poblacion!$C$8:$CV$93,$A15)","v":2878},{"$f":"VLOOKUP(T$8,Poblacion!$C$8:$CV$93,$A15)","v":2402},21690]
[92,"Adulto Joven (18-29años)",{"$f":"VLOOKUP(C$8,Poblacion!$C$8:$CV$93,$A16)","v":50},{"$f":"VLOOKUP(D$8,Poblacion!$C$8:$CV$93,$A16)","v":107},{"$f":"VLOOKUP(E$8,Poblacion!$C$8:$CV$93,$A16)","v":143},{"$f":"VLOOKUP(F$8,Poblacion!$C$8:$CV$93,$A16)","v":135},{"$f":"VLOOKUP(G$8,Poblacion!$C$8:$CV$93,$A16)","v":1774},{"$f":"VLOOKUP(H$8,Poblacion!$C$8:$CV$93,$A16)","v":224},{"$f":"VLOOKUP(I$8,Poblacion!$C$8:$CV$93,$A16)","v":424},{"$f":"VLOOKUP(J$8,Poblacion!$C$8:$CV$93,$A16)","v":180},3037,17.201925800056642,null,{"$f":"VLOOKUP(N$8,Poblacion!$C$8:$CV$93,$A16)","v":8907},null,{"$f":"VLOOKUP(P$8,Poblacion!$C$8:$CV$93,$A16)","v":8069},{"$f":"VLOOKUP(Q$8,Poblacion!$C$8:$CV$93,$A16)","v":18100},{"$f":"VLOOKUP(R$8,Poblacion!$C$8:$CV$93,$A16)","v":6213},{"$f":"VLOOKUP(S$8,Poblacion!$C$8:$CV$93,$A16)","v":5382},{"$f":"VLOOKUP(T$8,Poblacion!$C$8:$CV$93,$A16)","v":3532},41296]
[93,"Adulto    (30-59años)",{"$f":"VLOOKUP(C$8,Poblacion!$C$8:$CV$93,$A17)","v":166},{"$f":"VLOOKUP(D$8,Poblacion!$C$8:$CV$93,$A17)","v":222},{"$f":"VLOOKUP(E$8,Poblacion!$C$8:$CV$93,$A17)","v":309},{"$f":"VLOOKUP(F$8,Poblacion!$C$8:$CV$93,$A17)","v":386},{"$f":"VLOOKUP(G$8,Poblacion!$C$8:$CV$93,$A17)","v":3194},{"$f":"VLOOKUP(H$8,Poblacion!$C$8:$CV$93,$A17)","v":569},{"$f":"VLOOKUP(I$8,Poblacion!$C$8:$CV$93,$A17)","v":897},{"$f":"VLOOKUP(J$8,Poblacion!$C$8:$CV$93,$A17)","v":419},6162,34.902293967714527,null,{"$f":"VLOOKUP(N$8,Poblacion!$C$8:$CV$93,$A17)","v":20181},null,{"$f":"VLOOKUP(P$8,Poblacion!$C$8:$CV$93,$A17)","v":15976},{"$f":"VLOOKUP(Q$8,Poblacion!$C$8:$CV$93,$A17)","v":36707},{"$f":"VLOOKUP(R$8,Poblacion!$C$8:$CV$93,$A17)","v":11656},{"$f":"VLOOKUP(S$8,Poblacion!$C$8:$CV$93,$A17)","v":10282},{"$f":"VLOOKUP(T$8,Poblacion!$C$8:$CV$93,$A17)","v":7088},81709]
[94,"Adu.Mayor (60 a MAS)",{"$f":"VLOOKUP(C$8,Poblacion!$C$8:$CV$93,$A18)","v":273},{"$f":"VLOOKUP(D$8,Poblacion!$C$8:$CV$93,$A18)","v":151},{"$f":"VLOOKUP(E$8,Poblacion!$C$8:$CV$93,$A18)","v":319},{"$f":"VLOOKUP(F$8,Poblacion!$C$8:$CV$93,$A18)","v":222},{"$f":"VLOOKUP(G$8,Poblacion!$C$8:$CV$93,$A18)","v":1058},{"$f":"VLOOKUP(H$8,Poblacion!$C$8:$CV$93,$A18)","v":473},{"$f":"VLOOKUP(I$8,Poblacion!$C$8:$CV$93,$A18)","v":484},{"$f":"VLOOKUP(J$8,Poblacion!$C$8:$CV$93,$A18)","v":311},3291,18.640611724723875,null,{"$f":"VLOOKUP(N$8,Poblacion!$C$8:$CV$93,$A18)","v":8733},null,{"$f":"VLOOKUP(P$8,Poblacion!$C$8:$CV$93,$A18)","v":5126},{"$f":"VLOOKUP(Q$8,Poblacion!$C$8:$CV$93,$A18)","v":13522},{"$f":"VLOOKUP(R$8,Poblacion!$C$8:$CV$93,$A18)","v":4058},{"$f":"VLOOKUP(S$8,Poblacion!$C$8:$CV$93,$A18)","v":3115},{"$f":"VLOOKUP(T$8,Poblacion!$C$8:$CV$93,$A18)","v":3649},29470]
[85,"Gestantes",{"$f":"VLOOKUP(C$8,Poblacion!$C$8:$CV$93,$A19)","v":8},{"$f":"VLOOKUP(D$8,Poblacion!$C$8:$CV$93,$A19)","v":15},{"$f":"VLOOKUP(E$8,Poblacion!$C$8:$CV$93,$A19)","v":36},{"$f":"VLOOKUP(F$8,Poblacion!$C$8:$CV$93,$A19)","v":14},{"$f":"VLOOKUP(G$8,Poblacion!$C$8:$CV$93,$A19)","v":172},{"$f":"VLOOKUP(H$8,Poblacion!$C$8:$CV$93,$A19)","v":19},{"$f":"VLOOKUP(I$8,Poblacion!$C$8:$CV$93,$A19)","v":77},{"$f":"VLOOKUP(J$8,Poblacion!$C$8:$CV$93,$A19)","v":26},367,2.0787312376097424,null,{"$f":"VLOOKUP(N$8,Poblacion!$C$8:$CV$93,$A19)","v":921},null,{"$f":"VLOOKUP(P$8,Poblacion!$C$8:$CV$93,$A19)","v":916},{"$f":"VLOOKUP(Q$8,Poblacion!$C$8:$CV$93,$A19)","v":2383},{"$f":"VLOOKUP(R$8,Poblacion!$C$8:$CV$93,$A19)","v":740},{"$f":"VLOOKUP(S$8,Poblacion!$C$8:$CV$93,$A19)","v":1038},{"$f":"VLOOKUP(T$8,Poblacion!$C$8:$CV$93,$A19)","v":425},5502]
[null," TOTAL",{"$f":"C13+C15+C16+C17+C18","v":607},{"$f":"D13+D15+D16+D17+D18","v":633},997,956,9159,1608,2524,1171,{"$f":"K13+K15+K16+K17+K18","v":17655},{"$f":"IFERROR((K20/$K$20)*100,0)","v":100},null,{"$f":"N13+N15+N16+N17+N18","v":50863},null,41083,95317,31235,27987,20293,215915]
{"$rows_left_out":19}
{"sheet":"Pobla_EESS","index":3,"n_rows":60,"n_cols":16,"rows_kept":60,"cut":false,"hidden":false,"merged":[[50,4,52,4],[51,11,54,11],[54,3,54,5],[55,11,57,11],[58,10,58,12],[1,3,4,10],[7,3,7,8],[7,10,7,15],[15,3,15,4],[25,4,29,4],[25,11,30,11],[30,4,31,4],[23,3,23,8],[23,10,23,15],[31,10,31,12],[39,4,45,4],[39,11,41,11],[42,11,46,11],[46,4,49,4],[9,4,13,4],[9,11,11,11],[12,11,16,11],[16,3,16,5],[19,10,19,12],[32,3,32,5],[37,3,37,8],[37,10,37,15]]}
[]
[null,null,null,"POBLACIÓN SEGÚN DISTRITOS Y EE.SS - 2022"]
[]
[]
[]
[]
[]
[null,null,null,"SIN MICRORED",null,null,null,null,null,null,"MICRORED HUALMAY"]
[null,null,null,"DISTRITO","POBLACIÓN","EE.SS","POBLACIÓN","MASCULINO","FEMENINO",null,"DISTRITO","POBLACIÓN","EE.SS","POBLACIÓN","MASCULINO","FEMENINO"]
[null,null,null,"HUACHO",{"$f":"SUM(G10)","v":50863},"HOSPITAL HUACHO",{"$f":"VLOOKUP($F10,Poblacion!$E$8:$I$87,2,FALSE)","v":50863},{"$f":"VLOOKUP($F10,Poblacion!$E$8:$I$87,4,FALSE)","v":24915},{"$f":"VLOOKUP($F10,Poblacion!$E$8:$I$87,5,FALSE)","v":25948},null,"HUALMAY",{"$f":"SUM(N10:N12)","v":29514},"C.S. HUALMAY",{"$f":"VLOOKUP($M10,Poblacion!$E$8:$I$87,2,FALSE)","v":14182},{"$f":"VLOOKUP($M10,Poblacion!$E$8:$I$87,4,FALSE)","v":7037},{"$f":"VLOOKUP($M10,Poblacion!$E$8:$I$87,5,FALSE)","v":7145}]
[null,null,null,"HUACHO",null,"CLINICA SAN PEDRO",0,null,null,null,"HUALMAY",null,"P.S. DGO. MANDAMIENTO",{"$f":"VLOOKUP($M11,Poblacion!$E$8:$I$87,2,FALSE)","v":10610},{"$f":"VLOOKUP($M11,Poblacion!$E$8:$I$87,4,FALSE)","v":5264},{"$f":"VLOOKUP($M11,Poblacion!$E$8:$I$87,5,FALSE)","v":5346}]
[null,null,null,"HUACHO",null,"ESSALUD GUSTAVO LA NATA",0,null,null,null,"HUALMAY",null,"P.S. CAMPO ALEGRE",{"$f":"VLOOKUP($M12,Poblacion!$E$8:$I$87,2,FALSE)","v":4722},{"$f":"VLOOKUP($M12,Poblacion!$E$8:$I$87,4,FALSE)","v":2342},{"$f":"VLOOKUP($M12,Poblacion!$E$8:$I$87,5,FALSE)","v":2380}]
[null,null,null,"HUACHO",null,"CLINICA SAN BARTOLOME",0,null,null,null,"S.MARIA",{"$f":"SUM(N13:N17)","v":40189},"C.S. SANTA MARIA",{"$f":"VLOOKUP($M13,Poblacion!$E$8:$I$87,2,FALSE)","v":11252},{"$f":"VLOOKUP($M13,Poblacion!$E$8:$I$87,4,FALSE)","v":5639},{"$f":"VLOOKUP($M13,Poblacion!$E$8:$I$87,5,FALSE)","v":5613}]
[null,null,null,"HUACHO",null,"GOLD ESTANDAR EIRL.",0,null,null,null,"S.MARIA",null,"P.S. CHONTA",{"$f":"VLOOKUP($M14,Poblacion!$E$8:$I$87,2,FALSE)","v":6028},{"$f":"VLOOKUP($M14,Poblacion!$E$8:$I$87,4,FALSE)","v":3019},{"$f":"VLOOKUP($M14,Poblacion!$E$8:$I$87,5,FALSE)","v":3009}]
[null,null,null,"CARQUIN",null,"INSITUTO NACIONAL PENITENCIARIO CARQUIN",0,null,null,null,"S.MARIA",null,"P.S. ZAPATA",{"$f":"VLOOKUP($M15,Poblacion!$E$8:$I$87,2,FALSE)","v":4007},{"$f":"VLOOKUP($M15,Poblacion!$E$8:$I$87,4,FALSE)","v":2005},{"$f":"VLOOKUP($M15,Poblacion!$E$8:$I$87,5,FALSE)","v":2002}]
[null,null,null,null,null,"OTROS ESTABLECIMIENTOS",0,null,null,null,"S.MARIA",null,"P.S. AMADO VELASQUEZ",{"$f":"VLOOKUP($M16,Poblacion!$E$8:$I$87,2,FALSE)","v":11252},{"$f":"VLOOKUP($M16,Poblacion!$E$8:$I$87,4,FALSE)","v":5639},{"$f":"VLOOKUP($M16,Poblacion!$E$8:$I$87,5,FALSE)","v":5613}]
[null,null,null,"TOTAL SIN MICRORED",null,null,{"$f":"SUM(G10:G16)","v":50863},{"$f":"SUM(H10:H16)","v":24915},{"$f":"SUM(I10:I16)","v":25948},null,"S.MARIA",null,"P.S. SAN BARTOLOME",{"$f":"VLOOKUP($M17,Poblacion!$E$8:$I$87,2,FALSE)","v":7650},{"$f":"VLOOKUP($M17,Poblacion!$E$8:$I$87,4,FALSE)","v":3837},{"$f":"VLOOKUP($M17,Poblacion!$E$8:$I$87,5,FALSE)","v":3813}]
[null,null,null,{"$f":"'etapas y mredes'!B21","v":"Elaboración: Área de Estadística - RIS Huaura Oyón."},null,null,null,null,null,null,"CARQUIN",{"$f":"N18","v":6806},"P.S. CARQUIN",{"$f":"VLOOKUP($M18,Poblacion!$E$8:$I$87,2,FALSE)","v":6806},{"$f":"VLOOKUP($M18,Poblacion!$E$8:$I$87,4,FALSE)","v":3475},{"$f":"VLOOKUP($M18,Poblacion!$E$8:$I$87,5,FALSE)","v":3331}]
[null,null,null,null,null,null,null,null,null,null,"HUACHO",{"$f":"N19","v":18808},"C.S. MANZANARES",{"$f":"VLOOKUP($M19,Poblacion!$E$8:$I$87,2,FALSE)","v":18808},{"$f":"VLOOKUP($M19,Poblacion!$E$8:$I$87,4,FALSE)","v":9214},{"$f":"VLOOKUP($M19,Poblacion!$E$8:$I$87,5,FALSE)","v":9594}]
[null,null,null,null,null,null,null,null,null,null,"TOTAL MCR HUALMAY",null,"TOTAL MICRORED HUALMAY",{"$f":"SUM(N10:N19)","v":95317},{"$f":"SUM(O10:O19)","v":47471},{"$f":"SUM(P10:P19)","v":47846}]
{"$rows_left_out":40}