{"text_format":"1","workbook":"xlsx","n_sheets":4,"sheets":["Interfaz","Poblacion","etapas y mredes","Pobla_EESS"],"not_rendered":{"charts":1,"images":13,"macros":1,"external_links":1,"defined_names":4,"comments":0,"pivot_tables":0},"unopened":[],"bounds":{"document_bytes":16777216,"sheet_cells":100000,"rows_first":2000,"rows_last":500,"rows_between":2000,"halvings":0,"cell_chars":16384,"cell_head_chars":4096},"cells_cut":0,"cells_raw":0,"read":"whole","date_system":"1900"}

{"sheet":"Interfaz","index":0,"n_rows":27,"n_cols":18,"rows_kept":27,"cut":false,"hidden":false,"merged":[[4,2,7,11],[9,2,11,11]]}
[]
[]
[]
[]
[null,null,"POBLACIÓN ASIGNADA SEGÚN CENSOS INEI - RENIEC - PN - CNV - 2020"]
[]
[]
[]
[]
[null,null,"RED INTEGRADA DE SALUD HUAURA OYÓN "]
[]
[]
[]
[]
[]
[]
[]
[]
[]
[]
{"$rows_left_out":8}
{"sheet":"Poblacion","index":1,"n_rows":93,"n_cols":132,"rows_kept":93,"cut":false,"hidden":false,"merged":[[5,64,5,65],[5,48,5,49],[5,56,5,57],[5,66,5,67],[5,62,5,63],[5,46,5,47],[5,40,5,41],[4,42,4,43],[4,44,4,45],[5,42,5,43],[5,44,5,45],[5,24,5,25],[5,26,5,27],[4,16,4,17],[5,16,5,17],[4,38,4,39],[5,38,5,39],[4,5,6,5],[4,66,4,67],[5,12,5,13],[4,14,4,15],[5,14,5,15],[5,58,5,59],[5,36,5,37],[4,28,4,29],[5,32,5,33],[5,34,5,35],[5,28,5,29],[5,30,5,31],[5,54,5,55],[4,60,4,61],[5,60,5,61],[4,62,4,63],[4,7,6,7],[4,8,6,8],[5,50,5,51],[4,52,4,53],[5,52,5,53],[4,10,4,11],[5,10,5,11],[4,12,4,13],[4,18,4,19],[4,20,4,21],[4,22,4,23],[4,24,4,25],[4,26,4,27],[5,18,5,19],[5,20,5,21],[5,22,5,23],[1,30,1,65],[2,30,2,65],[4,58,4,59],[4,48,4,49],[3,30,3,65],[4,36,4,37],[4,56,4,57],[4,30,4,31],[4,32,4,33],[4,34,4,35],[4,50,4,51],[4,54,4,55],[4,64,4,65],[4,40,4,41],[4,46,4,47],[4,74,4,75],[5,74,5,75],[4,89,6,89],[4,88,6,88],[4,83,5,85],[4,86,6,86],[5,77,5,78],[5,79,5,80],[5,68,5,69],[5,70,5,71],[5,72,5,73],[4,72,4,73],[4,70,4,71],[4,68,4,69],[5,76,6,76],[4,76,4,80],[4,81,6,81],[4,82,6,82],[2,93,2,100],[4,98,6,98],[4,97,6,97],[4,91,6,91],[4,92,6,92],[4,93,6,93],[4,95,6,95],[4,94,6,94],[4,90,6,90],[4,99,6,99]]}
[null,null,1,2,3,4,5,6,7,8,9,10,11,12,13,14,15,16,17,18,19,20,21,22,23,24,25,26,27,28,29,30,31,32,33,34,35,36,37,38,39,40,41,42,43,44,45,46,47,48,49,50,51,52,53,54,55,56,57,58,59,60,61,62,63,64,65,66,67,68,69,70,71,72,73,74,75,76,77,78,79,80,81,82,83,84,85,86,87,88,89,90,91,92,93,94,95,96,97,98,null,null,null,77,78,79,80,81,82,83,84,85,86,87,88,89,90,91,92,93,94,95,96,97,98,99,106,107,108,109,110,111]
[null,null,null,null,null,null,null,null,null,null,null,null,null,null,null,null,null,null,null,null,null,null,null,null,null,null,null,null,null,null,"POBLACIÓN ESTIMADA POR GRUPOS DE EDAD, SEGÚN PROVINCIAS DISTRITOS Y ESTABLECIMIENTOS DE SALUD"]
[null,null,null,null,null,null,null,null,null,null,null,null,null,null,null,null,null,null,null,null,null,null,null,null,null,null,null,null,null,null,"RED INTEGRADA DE SALUD HUAURA OYON   -   AÑO  2020",null,null,null,null,null,null,null,null,null,null,null,null,null,null,null,null,null,null,null,null,null,null,null,null,null,null,null,null,null,null,null,null,null,null,null,null,null,null,null,null,null,null,null,{"$f":"ROUND(BY3,0)","v":0},null,null,null,null,null,null,null,null,null,null,null,null,null,null,null,null,null,null,"MAS GRUPOS DE EDAD"]
[null,null,null,null,null,null,null,null,null,null,null,null,null,null,null,null,null,null,null,null,null,null,null,null,null,null,null,null,null,null,"EDADES PUNTUALES Y GRUPOS DE EDAD"]
[null,null,"N°",null,"DIRECCION DE SALUD","TOTAL GENERAL",null,"TOTAL MASCULINO","TOTAL FEMENINO",null,"EDAD",null,"EDAD",null,"EDAD",null,"EDAD",null,"EDAD",null,"EDAD",null,"EDAD",null,"EDAD",null,"EDAD",null,"EDAD",null,"EDAD",null,"EDAD",null,"EDAD",null,"EDAD",null,"EDAD",null,"EDAD",null,"EDAD",null,"EDAD",null,"EDAD",null,"EDAD",null,"EDAD",null,"EDAD",null,"EDAD",null,"EDAD",null,"EDAD",null,"EDAD",null,"EDAD",null,"EDAD",null,"EDAD",null,"EDAD",null,"EDAD",null,"EDAD",null,"EDAD",null,"EDADES ESPECIALES",null,null,null,null,"NACIMIENTOS","POBLACION FEMENINA TOTAL","POBLACION FEMENINA",null,null,"GESTANTES  ESPERADAS",null,"menor de 1 Año","Pre escolar         (1-4)","Niño             (0 - 11)","Escolar               (05 - 17)","Adolescente (12 - 17)","Adulto Joven (18 - 29)","Adulto            (30-59)","Adu.Mayor (60 a MAS)",null,"Escolar               (05 - 09)","Adolescente (10 - 19)","Adulto            (20-59)"]
["UBIGEO",null,null,null,"PROVINCIA",null,null,null,null,null,0,null,1,null,2,null,3,null,4,null,5,null,6,null,7,null,8,null,9,null,10,null,11,null,12,null,13,null,14,null,15,null,16,null,17,null,18,null,19,null,"20 - 24",null,"25 - 29",null,"30 - 34",null,"35 - 39",null,"40 - 44 ",null,"45 - 49",null,"50 - 54 ",null,"55 - 59 ",null,"60 - 64",null,"65 - 69 ",null,"70- 74 ",null,"75 - 79 ",null,"80 - +",null,"28 DIAS","0-5 MESES",null,"6-11 MESES"]
[null,"Microredes",null,"RENAES","DISTRITO",null,null,null,null,null,"M","F","M","F","M","F","M","F","M","F","M","F","M","F","M","F","M","F","M","F","M","F","M","F","M","F","M","F","M","F","M","F","M","F","M","F","M","F","M","F","M","F","M","F","M","F","M","F","M","F","M","F","M","F","M","F","M","F","M","F","M","F","M","F","M","F",null,"M","F","M","F",null,null," 10 - 14","15 - 19","20 - 49"]
[150000,null,1,null,"HUAURA - OYON",264916,null,128466,136450,null,2056,1926,2122,2033,1772,1747,1845,1769,2047,1952,2124,1973,1624,1611,1627,1681,1714,1689,1728,1818,1894,1847,1923,1948,2064,1890,1956,1987,1972,2457,1673,1648,1620,1650,1648,1569,1645,1535,1613,2600,8688,10780,9472,10079,9169,9183,9932,9568,9446,9486,7639,9690,7478,8244,7178,7264,5700,6127,5188,5958,4923,4542,3098,3470,3888,4729,396,1009,867,1047,1059,4477,0,10129,9002,58786,5947,null,{"$f":"SUM(K8:L8)","v":3982},{"$f":"SUM(M8:T8)","v":15287},{"$f":"SUM(K8:AH8)","v":44470},{"$f":"SUM(U8:AT8)","v":47335},{"$f":"SUM(AI8:AT8)","v":22134},{"$f":"SUM(AU8:BB8)","v":46412},{"$f":"SUM(BC8:BN8)","v":104277},{"$f":"SUM(BO8:BX8)","v":47623},null,{"$f":"SUM(U8:AD8)","v":17589},{"$f":"SUM(AE8:AX8)","v":37139},{"$f":"SUM(AY8:BN8)","v":143296}]
[150800,null,2,150800,"PROVINCIA HUAURA",240225,null,116559,123666,null,1917,1799,1975,1880,1642,1642,1699,1657,1881,1825,1972,1816,1423,1422,1423,1490,1501,1499,1537,1599,1686,1629,1717,1719,1847,1670,1756,1771,1764,2207,1515,1489,1471,1507,1498,1442,1504,1412,1469,2390,7939,9850,8571,9030,8234,8272,8926,8482,8565,8635,6925,8766,6848,7535,6600,6644,5261,5626,4663,5414,4477,4105,2777,3103,3576,4339,335,942,804,975,995,3934,0,8996,8240,53035,5207,null,{"$f":"SUM(K9:L9)","v":3716},{"$f":"SUM(M9:T9)","v":14201},{"$f":"SUM(K9:AH9)","v":40350},{"$f":"SUM(U9:AT9)","v":42370},{"$f":"SUM(AI9:AT9)","v":19937},{"$f":"SUM(AU9:BB9)","v":42165},{"$f":"SUM(BC9:BN9)","v":94432},{"$f":"SUM(BO9:BX9)","v":43341},null,15682,33463,129822]
[150801,null,3,150802,"DISTRITO HUACHO",65329,null,31678,33651,null,494,453,474,441,332,416,407,392,488,489,488,457,331,332,354,327,373,331,389,351,379,410,388,437,451,399,402,453,447,516,372,358,348,376,338,382,402,317,354,609,1986,2590,2298,2225,1906,2371,2554,2115,2580,2218,1854,2684,1922,2541,1909,2113,1698,1514,1535,1486,1427,1174,924,922,1074,1452,81,253,196,241,257,943,0,2215,2042,14203,1249,null,947,3439,9733,10189,4842,10781,26767,13206,null,3733,8138,35866]
[null,"00",4,7639,"HOSPITAL HUACHO",48997,null,23759,25238,null,370,340,355,331,249,312,305,294,366,367,366,343,248,249,265,245,280,248,292,263,284,307,291,328,338,299,301,340,335,387,279,268,261,282,253,286,301,238,266,457,1490,1942,1724,1669,1430,1778,1916,1586,1935,1663,1391,2013,1442,1906,1432,1585,1274,1135,1151,1115,1070,881,693,692,806,1089,61,189,147,181,193,707,null,1661,1531,10651,937,null,710,2579,7298,7638,3629,8087,20077,9906,null,2799,6101,26902]
[null,"02",5,5679,"C.S. MANZANARES",16332,null,7919,8413,null,124,113,119,110,83,104,102,98,122,122,122,114,83,83,89,82,93,83,97,88,95,103,97,109,113,100,101,113,112,129,93,90,87,94,85,96,101,79,88,152,496,648,574,556,476,593,638,529,645,555,463,671,480,635,477,528,424,379,384,371,357,293,231,230,268,363,20,64,49,60,64,236,null,554,511,3552,312,null,237,860,2435,2551,1213,2694,6690,3300,null,934,2037,8964]
[150802,null,6,150802,"DISTRITO AMBAR",2882,null,1387,1495,null,25,20,21,20,15,14,21,20,20,16,20,13,28,27,26,29,29,28,25,31,28,27,26,28,24,27,26,23,23,28,17,17,17,15,16,12,14,14,15,25,97,99,82,96,82,94,90,95,76,97,84,112,78,100,85,72,71,72,70,77,51,57,32,41,53,49,3,12,11,13,9,39,0,133,83,593,60,null,45,147,557,610,245,442,1065,573,null,256,422,1439]
[null,"01",7,5680,"C.S. AMBAR",1729,null,834,895,null,15,12,13,12,9,8,13,12,12,10,12,8,17,16,16,17,17,17,15,19,17,16,16,17,14,16,16,14,14,17,10,10,10,9,10,7,8,8,9,15,58,59,49,58,49,56,54,57,46,58,50,67,47,60,51,43,43,43,42,46,31,34,19,25,32,29,2,7,7,8,5,23,null,80,49,355,36,null,27,89,336,367,147,264,638,344,null,154,253,862]
[null,"01",8,5681,"P.S. AYNACA",1153,null,553,600,null,10,8,8,8,6,6,8,8,8,6,8,5,11,11,10,12,12,11,10,12,11,11,10,11,10,11,10,9,9,11,7,7,7,6,6,5,6,6,6,10,39,40,33,38,33,38,36,38,30,39,34,45,31,40,34,29,28,29,28,31,20,23,13,16,21,20,1,5,4,5,4,16,null,53,34,238,24,null,18,58,221,243,98,178,427,229,null,102,169,577]
[150803,null,9,150803,"DISTRITO CARQUIN",7324,null,3595,3729,null,49,59,42,52,56,45,46,64,52,48,53,46,41,46,47,40,49,38,39,50,41,51,51,41,50,44,46,47,53,54,39,43,44,37,45,37,37,46,44,70,282,313,343,295,294,324,294,265,312,291,231,225,189,262,208,181,125,175,139,173,118,98,52,75,84,94,14,29,32,20,27,129,0,237,233,1713,174,null,108,405,1146,1172,539,1430,3076,1133,null,449,920,4309]
[null,"02",10,5664,"P.S. CARQUIN",7324,null,3595,3729,null,49,59,42,52,56,45,46,64,52,48,53,46,41,46,47,40,49,38,39,50,41,51,51,41,50,44,46,47,53,54,39,43,44,37,45,37,37,46,44,70,282,313,343,295,294,324,294,265,312,291,231,225,189,262,208,181,125,175,139,173,118,98,52,75,84,94,14,29,32,20,27,129,null,237,233,1713,174,null,108,405,1146,1172,539,1430,3076,1133,null,449,920,4309]
[150804,null,11,150804,"DISTRITO CHECRAS",1949,null,952,997,null,5,4,2,7,4,0,5,5,2,1,8,2,9,11,12,10,11,11,13,11,15,12,14,14,16,13,15,12,10,17,10,11,8,9,8,7,7,7,4,11,29,33,45,46,39,44,69,65,65,72,64,66,87,87,69,68,65,74,65,65,79,97,47,49,51,56,0,2,2,3,2,32,0,68,45,326,47,null,9,26,188,289,136,182,795,648,null,98,220,948]
[null,"05",12,5663,"P.S. PUÑUN",1949,null,952,997,null,5,4,2,7,4,0,5,5,2,1,8,2,9,11,12,10,11,11,13,11,15,12,14,14,16,13,15,12,10,17,10,11,8,9,8,7,7,7,4,11,29,33,45,46,39,44,69,65,65,72,64,66,87,87,69,68,65,74,65,65,79,97,47,49,51,56,0,2,2,3,2,32,null,68,45,326,47,null,9,26,188,289,136,182,795,648,null,98,220,948]
[150805,null,13,150805,"DISTRITO HUALMAY",31314,null,15514,15800,null,201,206,229,244,219,202,224,199,214,223,297,274,178,185,191,183,174,212,188,218,239,195,248,203,241,223,259,203,241,273,189,197,171,208,182,190,207,162,189,307,1109,1183,1230,1055,1180,984,1274,1055,1104,1257,897,1064,967,890,926,873,613,818,629,744,541,482,327,450,436,638,43,91,104,110,102,514,0,1097,1064,6598,674,null,407,1754,5146,5562,2577,5442,12471,5678,null,2100,4327,17048]
{"$rows_left_out":74}
{"sheet":"etapas y mredes","index":2,"n_rows":38,"n_cols":21,"rows_kept":38,"cut":false,"hidden":false,"merged":[[6,15,6,20],[6,2,6,11],[1,2,5,12],[36,2,36,3],[35,2,35,3],[34,2,34,3],[33,2,33,3],[32,2,32,3],[31,2,31,3],[30,2,30,3],[29,2,29,3],[28,2,28,3],[27,2,27,3],[26,2,26,3],[25,2,25,3],[36,4,36,5],[35,4,35,5],[34,4,34,5],[33,4,33,5],[32,4,32,5],[31,4,31,5],[25,4,25,5],[30,4,30,5],[29,4,29,5],[28,4,28,5],[27,4,27,5],[26,4,26,5]]}
[]
[null,null,"POBLACION ASIGNADA POR DISTRITO SIERRA, HOSPITAL, MICROREDES Y POR ETAPAS DE VIDA 2020"]
[]
[]
[]
[]
[null,null,"DISTRITO",null,null,null,null,null,null,null,null,null,null,null,null,"MICROREDES"]
[null,null,65,67,11,74,60,28,76,33,null,null,null,4,null,82,83,84,85,86]
[null,"POBLACION POR\nETAPAS DE VIDA","Andajes","Caujul","Checras","Naván","Oyón","Paccho","Pachangara","Santa Leonor","TOTAL","PORC. (%)",null,"HOSPITAL HUACHO",null,"HUAURA","HUALMAY","SAYAN","VEGUETA","CHURIN OYON","Total Microredes"]
[75,"Neonatal (0-28dias)",{"$f":"VLOOKUP(C$8,Poblacion!$C$8:$CV$93,$A10)","v":1},{"$f":"VLOOKUP(D$8,Poblacion!$C$8:$CV$93,$A10)","v":1},{"$f":"VLOOKUP(E$8,Poblacion!$C$8:$CV$93,$A10)","v":0},{"$f":"VLOOKUP(F$8,Poblacion!$C$8:$CV$93,$A10)","v":8},{"$f":"VLOOKUP(G$8,Poblacion!$C$8:$CV$93,$A10)","v":23},{"$f":"VLOOKUP(H$8,Poblacion!$C$8:$CV$93,$A10)","v":2},{"$f":"VLOOKUP(I$8,Poblacion!$C$8:$CV$93,$A10)","v":5},{"$f":"VLOOKUP(J$8,Poblacion!$C$8:$CV$93,$A10)","v":0},{"$f":"SUM(C10:J10)","v":40},{"$f":"IFERROR((K10/$K$20)*100,0)","v":0.17167381974248927},null,{"$f":"VLOOKUP(N$8,Poblacion!$C$8:$CV$93,$A10)","v":61},null,{"$f":"VLOOKUP(P$8,Poblacion!$C$8:$CV$93,$A10)","v":66},{"$f":"VLOOKUP(Q$8,Poblacion!$C$8:$CV$93,$A10)","v":127},{"$f":"VLOOKUP(R$8,Poblacion!$C$8:$CV$93,$A10)","v":64},{"$f":"VLOOKUP(S$8,Poblacion!$C$8:$CV$93,$A10)","v":29},{"$f":"VLOOKUP(T$8,Poblacion!$C$8:$CV$93,$A10)","v":49},{"$f":"SUM(P10:T10)","v":335}]
[87,"Infantil (Men.1año)",{"$f":"VLOOKUP(C$8,Poblacion!$C$8:$CV$93,$A11)","v":6},{"$f":"VLOOKUP(D$8,Poblacion!$C$8:$CV$93,$A11)","v":8},{"$f":"VLOOKUP(E$8,Poblacion!$C$8:$CV$93,$A11)","v":9},{"$f":"VLOOKUP(F$8,Poblacion!$C$8:$CV$93,$A11)","v":7},{"$f":"VLOOKUP(G$8,Poblacion!$C$8:$CV$93,$A11)","v":115},{"$f":"VLOOKUP(H$8,Poblacion!$C$8:$CV$93,$A11)","v":13},{"$f":"VLOOKUP(I$8,Poblacion!$C$8:$CV$93,$A11)","v":50},{"$f":"VLOOKUP(J$8,Poblacion!$C$8:$CV$93,$A11)","v":12},{"$f":"SUM(C11:J11)","v":220},{"$f":"IFERROR((K11/$K$20)*100,0)","v":0.94420600858369097},null,{"$f":"VLOOKUP(N$8,Poblacion!$C$8:$CV$93,$A11)","v":710},null,{"$f":"VLOOKUP(P$8,Poblacion!$C$8:$CV$93,$A11)","v":647},{"$f":"VLOOKUP(Q$8,Poblacion!$C$8:$CV$93,$A11)","v":1405},{"$f":"VLOOKUP(R$8,Poblacion!$C$8:$CV$93,$A11)","v":452},{"$f":"VLOOKUP(S$8,Poblacion!$C$8:$CV$93,$A11)","v":498},{"$f":"VLOOKUP(T$8,Poblacion!$C$8:$CV$93,$A11)","v":270},{"$f":"SUM(P11:T11)","v":3272}]
[88,"Pre-escolar (01-04años)",{"$f":"VLOOKUP(C$8,Poblacion!$C$8:$CV$93,$A12)","v":21},{"$f":"VLOOKUP(D$8,Poblacion!$C$8:$CV$93,$A12)","v":32},{"$f":"VLOOKUP(E$8,Poblacion!$C$8:$CV$93,$A12)","v":26},{"$f":"VLOOKUP(F$8,Poblacion!$C$8:$CV$93,$A12)","v":37},{"$f":"VLOOKUP(G$8,Poblacion!$C$8:$CV$93,$A12)","v":468},{"$f":"VLOOKUP(H$8,Poblacion!$C$8:$CV$93,$A12)","v":83},{"$f":"VLOOKUP(I$8,Poblacion!$C$8:$CV$93,$A12)","v":174},{"$f":"VLOOKUP(J$8,Poblacion!$C$8:$CV$93,$A12)","v":43},884,3.7939914163090132,null,{"$f":"VLOOKUP(N$8,Poblacion!$C$8:$CV$93,$A12)","v":2579},null,{"$f":"VLOOKUP(P$8,Poblacion!$C$8:$CV$93,$A12)","v":2276},{"$f":"VLOOKUP(Q$8,Poblacion!$C$8:$CV$93,$A12)","v":5310},{"$f":"VLOOKUP(R$8,Poblacion!$C$8:$CV$93,$A12)","v":1994},{"$f":"VLOOKUP(S$8,Poblacion!$C$8:$CV$93,$A12)","v":2038},{"$f":"VLOOKUP(T$8,Poblacion!$C$8:$CV$93,$A12)","v":1090},12708]
[89,"Niño (0-11años)",{"$f":"VLOOKUP(C$8,Poblacion!$C$8:$CV$93,$A13)","v":91},{"$f":"VLOOKUP(D$8,Poblacion!$C$8:$CV$93,$A13)","v":156},{"$f":"VLOOKUP(E$8,Poblacion!$C$8:$CV$93,$A13)","v":188},{"$f":"VLOOKUP(F$8,Poblacion!$C$8:$CV$93,$A13)","v":145},{"$f":"VLOOKUP(G$8,Poblacion!$C$8:$CV$93,$A13)","v":1897},{"$f":"VLOOKUP(H$8,Poblacion!$C$8:$CV$93,$A13)","v":301},{"$f":"VLOOKUP(I$8,Poblacion!$C$8:$CV$93,$A13)","v":527},{"$f":"VLOOKUP(J$8,Poblacion!$C$8:$CV$93,$A13)","v":215},3520,15.107296137339056,null,{"$f":"VLOOKUP(N$8,Poblacion!$C$8:$CV$93,$A13)","v":7298},null,{"$f":"VLOOKUP(P$8,Poblacion!$C$8:$CV$93,$A13)","v":6921},{"$f":"VLOOKUP(Q$8,Poblacion!$C$8:$CV$93,$A13)","v":15265},{"$f":"VLOOKUP(R$8,Poblacion!$C$8:$CV$93,$A13)","v":5724},{"$f":"VLOOKUP(S$8,Poblacion!$C$8:$CV$93,$A13)","v":4951},{"$f":"VLOOKUP(T$8,Poblacion!$C$8:$CV$93,$A13)","v":4311},37172]
[90,"Escolar  (05-17años)",{"$f":"VLOOKUP(C$8,Poblacion!$C$8:$CV$93,$A14)","v":121},{"$f":"VLOOKUP(D$8,Poblacion!$C$8:$CV$93,$A14)","v":194},{"$f":"VLOOKUP(E$8,Poblacion!$C$8:$CV$93,$A14)","v":289},{"$f":"VLOOKUP(F$8,Poblacion!$C$8:$CV$93,$A14)","v":181},{"$f":"VLOOKUP(G$8,Poblacion!$C$8:$CV$93,$A14)","v":2365},{"$f":"VLOOKUP(H$8,Poblacion!$C$8:$CV$93,$A14)","v":352},{"$f":"VLOOKUP(I$8,Poblacion!$C$8:$CV$93,$A14)","v":556},{"$f":"VLOOKUP(J$8,Poblacion!$C$8:$CV$93,$A14)","v":296},4354,18.686695278969957,null,{"$f":"VLOOKUP(N$8,Poblacion!$C$8:$CV$93,$A14)","v":7638},null,{"$f":"VLOOKUP(P$8,Poblacion!$C$8:$CV$93,$A14)","v":7912},{"$f":"VLOOKUP(Q$8,Poblacion!$C$8:$CV$93,$A14)","v":15966},{"$f":"VLOOKUP(R$8,Poblacion!$C$8:$CV$93,$A14)","v":5968},{"$f":"VLOOKUP(S$8,Poblacion!$C$8:$CV$93,$A14)","v":4534},{"$f":"VLOOKUP(T$8,Poblacion!$C$8:$CV$93,$A14)","v":5317},39697]
[91,"Adolescente (12-17años)",{"$f":"VLOOKUP(C$8,Poblacion!$C$8:$CV$93,$A15)","v":57},{"$f":"VLOOKUP(D$8,Poblacion!$C$8:$CV$93,$A15)","v":78},{"$f":"VLOOKUP(E$8,Poblacion!$C$8:$CV$93,$A15)","v":136},{"$f":"VLOOKUP(F$8,Poblacion!$C$8:$CV$93,$A15)","v":80},{"$f":"VLOOKUP(G$8,Poblacion!$C$8:$CV$93,$A15)","v":1051},{"$f":"VLOOKUP(H$8,Poblacion!$C$8:$CV$93,$A15)","v":147},{"$f":"VLOOKUP(I$8,Poblacion!$C$8:$CV$93,$A15)","v":253},{"$f":"VLOOKUP(J$8,Poblacion!$C$8:$CV$93,$A15)","v":136},1938,8.3175965665236049,null,{"$f":"VLOOKUP(N$8,Poblacion!$C$8:$CV$93,$A15)","v":3629},null,{"$f":"VLOOKUP(P$8,Poblacion!$C$8:$CV$93,$A15)","v":3914},{"$f":"VLOOKUP(Q$8,Poblacion!$C$8:$CV$93,$A15)","v":7416},{"$f":"VLOOKUP(R$8,Poblacion!$C$8:$CV$93,$A15)","v":2690},{"$f":"VLOOKUP(S$8,Poblacion!$C$8:$CV$93,$A15)","v":2119},{"$f":"VLOOKUP(T$8,Poblacion!$C$8:$CV$93,$A15)","v":2366},18505]
[92,"Adulto Joven (18-29años)",{"$f":"VLOOKUP(C$8,Poblacion!$C$8:$CV$93,$A16)","v":136},{"$f":"VLOOKUP(D$8,Poblacion!$C$8:$CV$93,$A16)","v":160},{"$f":"VLOOKUP(E$8,Poblacion!$C$8:$CV$93,$A16)","v":182},{"$f":"VLOOKUP(F$8,Poblacion!$C$8:$CV$93,$A16)","v":207},{"$f":"VLOOKUP(G$8,Poblacion!$C$8:$CV$93,$A16)","v":2050},{"$f":"VLOOKUP(H$8,Poblacion!$C$8:$CV$93,$A16)","v":277},{"$f":"VLOOKUP(I$8,Poblacion!$C$8:$CV$93,$A16)","v":442},{"$f":"VLOOKUP(J$8,Poblacion!$C$8:$CV$93,$A16)","v":187},3641,15.626609442060085,null,{"$f":"VLOOKUP(N$8,Poblacion!$C$8:$CV$93,$A16)","v":8087},null,{"$f":"VLOOKUP(P$8,Poblacion!$C$8:$CV$93,$A16)","v":7730},{"$f":"VLOOKUP(Q$8,Poblacion!$C$8:$CV$93,$A16)","v":15815},{"$f":"VLOOKUP(R$8,Poblacion!$C$8:$CV$93,$A16)","v":5851},{"$f":"VLOOKUP(S$8,Poblacion!$C$8:$CV$93,$A16)","v":4462},{"$f":"VLOOKUP(T$8,Poblacion!$C$8:$CV$93,$A16)","v":4467},38325]
[93,"Adulto    (30-59años)",{"$f":"VLOOKUP(C$8,Poblacion!$C$8:$CV$93,$A17)","v":436},{"$f":"VLOOKUP(D$8,Poblacion!$C$8:$CV$93,$A17)","v":429},{"$f":"VLOOKUP(E$8,Poblacion!$C$8:$CV$93,$A17)","v":795},{"$f":"VLOOKUP(F$8,Poblacion!$C$8:$CV$93,$A17)","v":495},{"$f":"VLOOKUP(G$8,Poblacion!$C$8:$CV$93,$A17)","v":4443},{"$f":"VLOOKUP(H$8,Poblacion!$C$8:$CV$93,$A17)","v":926},{"$f":"VLOOKUP(I$8,Poblacion!$C$8:$CV$93,$A17)","v":1145},{"$f":"VLOOKUP(J$8,Poblacion!$C$8:$CV$93,$A17)","v":620},9289,39.866952789699575,null,{"$f":"VLOOKUP(N$8,Poblacion!$C$8:$CV$93,$A17)","v":20077},null,{"$f":"VLOOKUP(P$8,Poblacion!$C$8:$CV$93,$A17)","v":15729},{"$f":"VLOOKUP(Q$8,Poblacion!$C$8:$CV$93,$A17)","v":36481},{"$f":"VLOOKUP(R$8,Poblacion!$C$8:$CV$93,$A17)","v":11864},{"$f":"VLOOKUP(S$8,Poblacion!$C$8:$CV$93,$A17)","v":9009},{"$f":"VLOOKUP(T$8,Poblacion!$C$8:$CV$93,$A17)","v":11117},84200]
[94,"Adu.Mayor (60 a MAS)",{"$f":"VLOOKUP(C$8,Poblacion!$C$8:$CV$93,$A18)","v":498},{"$f":"VLOOKUP(D$8,Poblacion!$C$8:$CV$93,$A18)","v":256},{"$f":"VLOOKUP(E$8,Poblacion!$C$8:$CV$93,$A18)","v":648},{"$f":"VLOOKUP(F$8,Poblacion!$C$8:$CV$93,$A18)","v":314},{"$f":"VLOOKUP(G$8,Poblacion!$C$8:$CV$93,$A18)","v":1315},{"$f":"VLOOKUP(H$8,Poblacion!$C$8:$CV$93,$A18)","v":793},{"$f":"VLOOKUP(I$8,Poblacion!$C$8:$CV$93,$A18)","v":675},{"$f":"VLOOKUP(J$8,Poblacion!$C$8:$CV$93,$A18)","v":413},4912,21.081545064377682,null,{"$f":"VLOOKUP(N$8,Poblacion!$C$8:$CV$93,$A18)","v":9906},null,{"$f":"VLOOKUP(P$8,Poblacion!$C$8:$CV$93,$A18)","v":6293},{"$f":"VLOOKUP(Q$8,Poblacion!$C$8:$CV$93,$A18)","v":17019},{"$f":"VLOOKUP(R$8,Poblacion!$C$8:$CV$93,$A18)","v":4775},{"$f":"VLOOKUP(S$8,Poblacion!$C$8:$CV$93,$A18)","v":4097},{"$f":"VLOOKUP(T$8,Poblacion!$C$8:$CV$93,$A18)","v":5533},37717]
[85,"Gestantes",{"$f":"VLOOKUP(C$8,Poblacion!$C$8:$CV$93,$A19)","v":14},{"$f":"VLOOKUP(D$8,Poblacion!$C$8:$CV$93,$A19)","v":27},{"$f":"VLOOKUP(E$8,Poblacion!$C$8:$CV$93,$A19)","v":47},{"$f":"VLOOKUP(F$8,Poblacion!$C$8:$CV$93,$A19)","v":58},{"$f":"VLOOKUP(G$8,Poblacion!$C$8:$CV$93,$A19)","v":342},{"$f":"VLOOKUP(H$8,Poblacion!$C$8:$CV$93,$A19)","v":47},{"$f":"VLOOKUP(I$8,Poblacion!$C$8:$CV$93,$A19)","v":86},{"$f":"VLOOKUP(J$8,Poblacion!$C$8:$CV$93,$A19)","v":36},657,2.8197424892703862,null,{"$f":"VLOOKUP(N$8,Poblacion!$C$8:$CV$93,$A19)","v":937},null,{"$f":"VLOOKUP(P$8,Poblacion!$C$8:$CV$93,$A19)","v":919},{"$f":"VLOOKUP(Q$8,Poblacion!$C$8:$CV$93,$A19)","v":1943},{"$f":"VLOOKUP(R$8,Poblacion!$C$8:$CV$93,$A19)","v":723},{"$f":"VLOOKUP(S$8,Poblacion!$C$8:$CV$93,$A19)","v":627},{"$f":"VLOOKUP(T$8,Poblacion!$C$8:$CV$93,$A19)","v":798},5010]
[null," TOTAL",{"$f":"C13+C15+C16+C17+C18","v":1218},{"$f":"D13+D15+D16+D17+D18","v":1079},1949,1241,10756,2444,3042,1571,{"$f":"K13+K15+K16+K17+K18","v":23300},{"$f":"IFERROR((K20/$K$20)*100,0)","v":100},null,{"$f":"N13+N15+N16+N17+N18","v":48997},null,40587,91996,30904,24638,27794,215919]
{"$rows_left_out":19}
{"sheet":"Pobla_EESS","index":3,"n_rows":60,"n_cols":16,"rows_kept":60,"cut":false,"hidden":false,"merged":[[50,4,52,4],[51,11,54,11],[54,3,54,5],[55,11,57,11],[58,10,58,12],[1,3,4,10],[7,3,7,8],[7,10,7,15],[15,3,15,4],[25,4,29,4],[25,11,30,11],[30,4,31,4],[23,3,23,8],[23,10,23,15],[31,10,31,12],[39,4,45,4],[39,11,41,11],[42,11,46,11],[46,4,49,4],[9,4,13,4],[9,11,11,11],[12,11,16,11],[16,3,16,5],[19,10,19,12],[32,3,32,5],[37,3,37,8],[37,10,37,15]]}
[]
[null,null,null,"POBLACIÓN SEGÚN DISTRITOS Y EE.SS - 2020"]
[]
[]
[]
[]
[]
[null,null,null,"SIN MICRORED",null,null,null,null,null,null,"MICRORED HUALMAY"]
[null,null,null,"DISTRITO","POBLACIÓN","EE.SS","POBLACIÓN","MASCULINO","FEMENINO",null,"DISTRITO","POBLACIÓN","EE.SS","POBLACIÓN","MASCULINO","FEMENINO"]
[null,null,null,"HUACHO",{"$f":"G10","v":48997},"HOSPITAL HUACHO",{"$f":"VLOOKUP($F10,Poblacion!$E$8:$I$87,2,FALSE)","v":48997},{"$f":"VLOOKUP($F10,Poblacion!$E$8:$I$87,4,FALSE)","v":23759},{"$f":"VLOOKUP($F10,Poblacion!$E$8:$I$87,5,FALSE)","v":25238},null,"HUALMAY",{"$f":"SUM(N10:N12)","v":31314},"C.S. HUALMAY",{"$f":"VLOOKUP($M10,Poblacion!$E$8:$I$87,2,FALSE)","v":15657},{"$f":"VLOOKUP($M10,Poblacion!$E$8:$I$87,4,FALSE)","v":7757},{"$f":"VLOOKUP($M10,Poblacion!$E$8:$I$87,5,FALSE)","v":7900}]
[null,null,null,"HUACHO",null,"CLINICA SAN PEDRO",0,null,null,null,"HUALMAY",null,"P.S. DGO. MANDAMIENTO",{"$f":"VLOOKUP($M11,Poblacion!$E$8:$I$87,2,FALSE)","v":10960},{"$f":"VLOOKUP($M11,Poblacion!$E$8:$I$87,4,FALSE)","v":5430},{"$f":"VLOOKUP($M11,Poblacion!$E$8:$I$87,5,FALSE)","v":5530}]
[null,null,null,"HUACHO",null,"ESSALUD GUSTAVO LA NATA",0,null,null,null,"HUALMAY",null,"P.S. CAMPO ALEGRE",{"$f":"VLOOKUP($M12,Poblacion!$E$8:$I$87,2,FALSE)","v":4697},{"$f":"VLOOKUP($M12,Poblacion!$E$8:$I$87,4,FALSE)","v":2327},{"$f":"VLOOKUP($M12,Poblacion!$E$8:$I$87,5,FALSE)","v":2370}]
[null,null,null,"HUACHO",null,"CLINICA SAN BARTOLOME",0,null,null,null,"S.MARIA",{"$f":"SUM(N13:N17)","v":37026},"C.S. SANTA MARIA",{"$f":"VLOOKUP($M13,Poblacion!$E$8:$I$87,2,FALSE)","v":10367},{"$f":"VLOOKUP($M13,Poblacion!$E$8:$I$87,4,FALSE)","v":4983},{"$f":"VLOOKUP($M13,Poblacion!$E$8:$I$87,5,FALSE)","v":5384}]
[null,null,null,"HUACHO",null,"GOLD ESTANDAR EIRL.",0,null,null,null,"S.MARIA",null,"P.S. CHONTA",{"$f":"VLOOKUP($M14,Poblacion!$E$8:$I$87,2,FALSE)","v":5554},{"$f":"VLOOKUP($M14,Poblacion!$E$8:$I$87,4,FALSE)","v":2669},{"$f":"VLOOKUP($M14,Poblacion!$E$8:$I$87,5,FALSE)","v":2885}]
[null,null,null,"CARQUIN",null,"INSITUTO NACIONAL PENITENCIARIO CARQUIN",0,null,null,null,"S.MARIA",null,"P.S. ZAPATA",{"$f":"VLOOKUP($M15,Poblacion!$E$8:$I$87,2,FALSE)","v":2962},{"$f":"VLOOKUP($M15,Poblacion!$E$8:$I$87,4,FALSE)","v":1424},{"$f":"VLOOKUP($M15,Poblacion!$E$8:$I$87,5,FALSE)","v":1538}]
[null,null,null,null,null,"OTROS ESTABLECIMIENTOS",0,null,null,null,"S.MARIA",null,"P.S. AMADO VELASQUEZ",{"$f":"VLOOKUP($M16,Poblacion!$E$8:$I$87,2,FALSE)","v":11108},{"$f":"VLOOKUP($M16,Poblacion!$E$8:$I$87,4,FALSE)","v":5339},{"$f":"VLOOKUP($M16,Poblacion!$E$8:$I$87,5,FALSE)","v":5769}]
[null,null,null,"TOTAL SIN MICRORED",null,null,{"$f":"SUM(G10:G16)","v":48997},{"$f":"SUM(H10:H16)","v":23759},{"$f":"SUM(I10:I16)","v":25238},null,"S.MARIA",null,"P.S. SAN BARTOLOME",{"$f":"VLOOKUP($M17,Poblacion!$E$8:$I$87,2,FALSE)","v":7035},{"$f":"VLOOKUP($M17,Poblacion!$E$8:$I$87,4,FALSE)","v":3381},{"$f":"VLOOKUP($M17,Poblacion!$E$8:$I$87,5,FALSE)","v":3654}]
[null,null,null,{"$f":"'etapas y mredes'!B21","v":"Elaboración: Área de Estadística - RIS Huaura Oyón."},null,null,null,null,null,null,"CARQUIN",{"$f":"N18","v":7324},"P.S. CARQUIN",{"$f":"VLOOKUP($M18,Poblacion!$E$8:$I$87,2,FALSE)","v":7324},{"$f":"VLOOKUP($M18,Poblacion!$E$8:$I$87,4,FALSE)","v":3595},{"$f":"VLOOKUP($M18,Poblacion!$E$8:$I$87,5,FALSE)","v":3729}]
[null,null,null,null,null,null,null,null,null,null,"HUACHO",{"$f":"N19","v":16332},"C.S. MANZANARES",{"$f":"VLOOKUP($M19,Poblacion!$E$8:$I$87,2,FALSE)","v":16332},{"$f":"VLOOKUP($M19,Poblacion!$E$8:$I$87,4,FALSE)","v":7919},{"$f":"VLOOKUP($M19,Poblacion!$E$8:$I$87,5,FALSE)","v":8413}]
[null,null,null,null,null,null,null,null,null,null,"TOTAL MCR HUALMAY",null,"TOTAL MICRORED HUALMAY",{"$f":"SUM(N10:N19)","v":91996},{"$f":"SUM(O10:O19)","v":44824},{"$f":"SUM(P10:P19)","v":47172}]
{"$rows_left_out":40}