{"text_format":"1","workbook":"xlsx","n_sheets":3,"sheets":["Interfaz","Poblacion","Pobla_EESS"],"not_rendered":{"charts":0,"images":10,"macros":1,"external_links":1,"defined_names":4,"comments":0,"pivot_tables":0},"unopened":[],"bounds":{"document_bytes":16777216,"sheet_cells":100000,"rows_first":2000,"rows_last":500,"rows_between":2000,"halvings":0,"cell_chars":16384,"cell_head_chars":4096},"cells_cut":0,"cells_raw":0,"read":"whole","date_system":"1900"}

{"sheet":"Interfaz","index":0,"n_rows":27,"n_cols":18,"rows_kept":27,"cut":false,"hidden":false,"merged":[[4,2,7,11],[9,2,11,11]]}
[]
[]
[]
[]
[null,null,"POBLACIÓN ASIGNADA SEGÚN CENSOS INEI - RENIEC - PN - CNV - 2019"]
[]
[]
[]
[]
[null,null,"RED INTEGRADA DE SALUD HUAURA OYÓN "]
[]
[]
[]
[]
[]
[]
[]
[]
[]
[]
{"$rows_left_out":8}
{"sheet":"Poblacion","index":1,"n_rows":93,"n_cols":89,"rows_kept":93,"cut":false,"hidden":false,"merged":[[5,48,5,49],[4,48,4,49],[4,46,4,47],[4,44,4,45],[5,55,6,55],[4,52,6,52],[4,53,6,53],[4,50,4,51],[5,50,5,51],[5,44,5,45],[5,46,5,47],[4,54,6,54],[4,55,4,57],[5,56,6,56],[1,20,1,41],[2,20,2,41],[4,34,4,35],[4,24,4,25],[3,20,3,41],[4,32,4,33],[4,26,4,27],[4,30,4,31],[4,40,4,41],[4,22,4,23],[4,7,6,7],[4,8,6,8],[5,26,5,27],[4,28,4,29],[5,28,5,29],[5,16,5,17],[5,18,5,19],[4,20,4,21],[5,20,5,21],[4,5,6,5],[4,42,4,43],[5,34,5,35],[5,30,5,31],[4,36,4,37],[5,36,5,37],[4,38,4,39],[5,22,5,23],[4,10,4,11],[4,12,4,13],[4,14,4,15],[4,16,4,17],[4,18,4,19],[5,10,5,11],[5,12,5,13],[5,14,5,15],[5,40,5,41],[5,24,5,25],[5,32,5,33],[5,42,5,43],[5,38,5,39],[4,58,6,58],[4,59,4,62],[5,57,6,57],[5,59,6,59],[5,60,6,60],[5,61,6,61],[5,62,6,62]]}
[null,null,1,2,3,4,5,6,7,8,9,10,11,12,13,14,15,16,17,18,19,20,21,22,23,24,25,26,27,28,29,30,31,32,33,34,35,36,37,38,39,40,41,42,43,44,45,46,47,48,49,50,51,54,55,56,57,null,null,null,77,78,79,80,81,82,83,84,85,86,87,88,89,90,91,92,93,94,95,96,97,98,99,106,107,108,109,110,111]
[]
[]
[]
[null,null,"N°",null,"DIRECCION DE SALUD","TOTAL GENERAL",null,"TOTAL MASCULINO","TOTAL FEMENINO",null,"EDAD",null,"EDAD",null,"EDAD",null,"EDAD",null,"EDAD",null,"EDAD",null,"EDAD",null,"EDAD",null,"EDAD",null,"EDAD",null,"EDAD",null,"EDAD",null,"EDAD",null,"EDAD",null,"EDAD",null,"EDAD",null,"EDAD",null,"EDAD",null,"EDAD",null,"EDAD",null,"EDAD",null,"NACIMIENTOS","28 DIAS DE NACIDO","POB.FEM. TOTAL","POB.FEMENINA",null,null,"GESTANTES","OTRO GRUPOS ESPECIFICOS EN POBLACION FEMENINA"]
["UBIGEO",null,null,null,"PROVINCIA",null,null,null,null,null,0,null,1,null,2,null,3,null,4,null,"5 - 9",null,"10 - 14",null,"15 - 19",null,"20 - 24",null,"25 - 29",null,"30 - 34",null,"35 - 39",null,"40 - 44 ",null,"45 - 49",null,"50 - 54 ",null,"55 - 59 ",null,"60 - 64",null,"65 - 69 ",null,"70- 74 ",null,"75 - 79 ",null,"80 - +",null,null,null,null,"10 - 14 Años","15 - 19 Años","20 - 49 Años",null,"12 - 17 Años","20 - 44 Años","30 - 49 Años","50 - 64 Años"]
[null,"Microredes",null,"RENAES","DISTRITO",null,null,null,null,null,"M","F","M","F","M","F","M","F","M","F","M","F","M","F","M","F","M","F","M","F","M","F","M","F","M","F","M","F","M","F","M","F","M","F","M","F","M","F","M","F","M","F"]
[150000,null,1,null,"HUAURA - OYON",257177,null,127341.19155000002,129835.80844999998,null,2077.6493999999998,2118.3506000000002,1720.64625,1754.35375,1778.08365,1812.91635,1999.4157,2038.5843,2059.3288499999999,2099.6711500000001,10395.179099999999,10598.820900000001,11587.99545,11815.00455,11056.20435,11272.79565,10621.9578,10830.0422,10309.51815,10511.48185,8671.0668000000005,8840.9331999999995,8887.9424999999992,9062.0575000000008,8509.1527499999993,8675.8472500000007,7133.6260499999999,7273.3739500000001,6542.4169499999998,6670.5830500000002,6124.5103499999996,6244.4896500000004,4963.8787499999999,5061.1212500000001,4249.3773000000001,4332.6226999999999,3510.1183499999997,3578.8816500000003,2440.5943499999998,2488.4056500000002,2702.5286999999998,2755.4713000000002,4408,342,130608,11457,11133,55574,6005,13566,46698,33032,17289]
[150800,null,2,150800,"PROVINCIA HUAURA",233117,null,115427.88254999999,117689.11745000002,null,1932.5704499999999,1970.4295500000001,1603.7908499999999,1635.2091500000001,1656.7719,1689.2281,1855.8221999999998,1892.1778000000002,1907.3177999999998,1944.6822000000002,9276.1400999999987,9457.8599000000013,10328.829,10531.171,10089.671549999999,10287.328450000001,9706.9205999999995,9897.0794000000005,9284.0625,9465.9375,7799.6027999999997,7952.3972000000003,7937.2545,8092.7455,7731.2720999999992,7882.7279000000008,6459.7268999999997,6586.2731000000003,5985.8683499999997,6103.1316500000003,5615.9912999999997,5726.0087000000003,4569.2442000000001,4658.7557999999999,3838.89795,3914.10205,3181.8339000000001,3244.1660999999999,2185.0969500000001,2227.9030499999999,2481.1966499999999,2529.8033500000001,3864,303,117765,10207,10157,50206,5261,12261,42202,29815,15884]
[150801,null,3,150802,"DISTRITO HUACHO",62543,null,30968.166449999997,31574.833550000003,null,467.42159999999996,476.57840000000004,370.86734999999999,378.13265000000001,386.21699999999998,393.78300000000002,477.32459999999998,486.67540000000002,474.84884999999997,484.15115000000003,2243.0295000000001,2286.9704999999999,2490.6044999999999,2539.3955000000001,2480.2063499999999,2528.7936500000001,2492.08995,2540.91005,2392.5648000000001,2439.4351999999999,2021.6974499999999,2061.3025499999999,2135.0868,2176.9132,2162.3200499999998,2204.6799500000002,1859.7834,1896.2166,1848.8900999999998,1885.1099000000002,1704.3063,1737.6937,1357.20615,1383.79385,1160.13645,1182.86355,965.04734999999994,983.95265000000006,689.74394999999993,703.25605000000007,788.77395000000001,804.22604999999999,928,73,31468,2454,2489,13372,1263,2981,11375,8278,4974]
[null,"00",4,7639,"HOSPITAL HUACHO",46907,null,23226.001049999992,23680.998950000008,null,350.56619999999998,357.43380000000002,278.27429999999998,283.72570000000002,289.66274999999996,295.33725000000004,357.99345,365.00655,356.01284999999996,362.98715000000004,1682.5196999999998,1715.4803000000002,1867.7058,1904.2942,1860.27855,1896.72145,1869.1912499999999,1905.8087500000001,1794.4235999999999,1829.5764000000001,1516.1493,1545.8507,1601.3151,1632.6849,1621.61625,1653.38375,1394.83755,1422.16245,1386.4199999999998,1413.5800000000002,1277.98215,1303.01785,1018.0283999999999,1037.9716000000001,869.97854999999993,887.02145000000007,723.90929999999992,738.09070000000008,517.43174999999997,527.56825000000003,591.70425,603.29575,696,55,23601,1840,1867,10029,947,2237,8532,6208,3729]
[null,"02",5,5679,"C.S. MANZANARES",15636,null,7742.1654000000008,7893.8345999999992,null,116.85539999999999,119.14460000000001,92.593049999999991,94.406950000000009,96.554249999999996,98.445750000000004,119.33114999999999,121.66885000000001,118.836,121.164,560.50979999999993,571.49020000000007,622.89869999999996,635.10130000000004,619.92779999999993,632.07220000000007,622.89869999999996,635.10130000000004,598.14120000000003,609.85879999999997,505.54814999999996,515.45185000000004,533.77170000000001,544.22829999999999,540.7038,551.2962,464.94585000000001,474.05414999999999,462.4701,471.5299,426.32414999999997,434.67585000000003,339.17775,345.82225,290.15789999999998,295.84210000000002,241.13804999999999,245.86195000000001,172.31219999999999,175.68780000000001,197.06969999999998,200.93030000000002,232,18,7867,614,622,3343,316,744,2843,2070,1245]
[150802,null,6,150802,"DISTRITO AMBAR",2766,null,1369.5849000000001,1396.4150999999999,null,16.835100000000001,17.164899999999999,10.8933,11.1067,20.30115,20.69885,16.835100000000001,17.164899999999999,11.883599999999999,12.116400000000001,154.98194999999998,158.01805000000002,151.02074999999999,153.97925000000001,104.47664999999999,106.52335000000001,108.43785,110.56215,94.078499999999991,95.921500000000009,83.185199999999995,84.814800000000005,83.68034999999999,85.31965000000001,77.243399999999994,78.756600000000006,80.214299999999994,81.785700000000006,73.777349999999998,75.222650000000002,66.350099999999998,67.649900000000002,59.913149999999995,61.086850000000005,55.951949999999997,57.048050000000003,40.107149999999997,40.892850000000003,26.738099999999999,27.261900000000001,32.679899999999996,33.320100000000004,44,3,1472,149,105,544,60,151,421,295,174]
[null,"01",7,5680,"C.S. AMBAR",1656,null,819.96839999999986,836.03160000000025,null,9.9029999999999987,10.097000000000001,6.4369499999999995,6.5630500000000005,12.37875,12.62125,9.9029999999999987,10.097000000000001,6.9321000000000002,7.0678999999999998,92.593049999999991,94.406950000000009,90.1173,91.8827,62.3889,63.6111,64.864649999999997,66.135350000000003,56.447099999999999,57.552900000000001,50.010149999999996,50.989850000000004,50.010149999999996,50.989850000000004,46.5441,47.4559,48.02955,48.97045,44.068349999999995,44.931650000000005,39.611999999999995,40.388000000000005,36.145949999999999,36.854050000000001,33.670200000000001,34.329799999999999,24.262349999999998,24.737650000000002,15.844799999999999,16.155200000000001,19.805999999999997,20.194000000000003,26,2,883,89,63,326,36,91,252,176,105]
[null,"01",8,5681,"P.S. AYNACA",1110,null,549.61649999999997,560.38350000000003,null,6.9321000000000002,7.0678999999999998,4.4563499999999996,4.5436500000000004,7.9223999999999997,8.0776000000000003,6.9321000000000002,7.0678999999999998,4.9514999999999993,5.0485000000000007,62.3889,63.6111,60.903449999999999,62.096550000000001,42.08775,42.91225,43.5732,44.4268,37.631399999999999,38.368600000000001,33.175049999999999,33.824950000000001,33.670200000000001,34.329799999999999,30.699299999999997,31.300700000000003,32.184750000000001,32.815249999999999,29.709,30.291,26.738099999999999,27.261900000000001,23.767199999999999,24.232800000000001,22.281749999999999,22.718250000000001,15.844799999999999,16.155200000000001,10.8933,11.1067,12.873899999999999,13.126100000000001,18,1,589,60,42,218,24,60,169,119,69]
[150803,null,9,150803,"DISTRITO CARQUIN",7095,null,3513.0892499999995,3581.9107500000005,null,43.5732,44.4268,48.02955,48.97045,54.961649999999999,56.038350000000001,47.039249999999996,47.960750000000004,47.534399999999998,48.465600000000002,258.4683,263.5317,277.77915000000002,283.22084999999998,284.21609999999998,289.78390000000002,326.79899999999998,333.20100000000002,338.18745000000001,344.81254999999999,291.64335,297.35665,255.00224999999998,259.99775,271.34219999999999,276.65780000000001,189.64245,193.35755,186.67155,190.32845,164.88495,168.11505,125.27294999999999,127.72705000000001,118.836,121.164,80.214299999999994,81.785700000000006,47.039249999999996,47.960750000000004,55.951949999999997,57.048050000000003,129,10,3655,275,287,1715,176,337,1438,971,452]
[null,"02",10,5664,"P.S. CARQUIN",7095,null,3513.0892499999995,3581.9107500000005,null,43.5732,44.4268,48.02955,48.97045,54.961649999999999,56.038350000000001,47.039249999999996,47.960750000000004,47.534399999999998,48.465600000000002,258.4683,263.5317,277.77915000000002,283.22084999999998,284.21609999999998,289.78390000000002,326.79899999999998,333.20100000000002,338.18745000000001,344.81254999999999,291.64335,297.35665,255.00224999999998,259.99775,271.34219999999999,276.65780000000001,189.64245,193.35755,186.67155,190.32845,164.88495,168.11505,125.27294999999999,127.72705000000001,118.836,121.164,80.214299999999994,81.785700000000006,47.039249999999996,47.960750000000004,55.951949999999997,57.048050000000003,129,10,3655,275,287,1715,176,337,1438,971,452]
[150804,null,11,150804,"DISTRITO CHECRAS",1782,null,882.35730000000012,899.64269999999988,null,4.9514999999999993,5.0485000000000007,1.9805999999999999,2.0194000000000001,5.44665,5.55335,1.4854499999999999,1.5145500000000001,4.9514999999999993,5.0485000000000007,55.456800000000001,56.543199999999999,80.70944999999999,82.29055000000001,52.485900000000001,53.514099999999999,34.165349999999997,34.834650000000003,48.524699999999996,49.475300000000004,39.611999999999995,40.388000000000005,60.903449999999999,62.096550000000001,61.893749999999997,63.106250000000003,53.971350000000001,55.028649999999999,72.787049999999994,74.212950000000006,58.922849999999997,60.077150000000003,58.922849999999997,60.077150000000003,50.010149999999996,50.989850000000004,65.854950000000002,67.145049999999998,35.650799999999997,36.349200000000003,33.670200000000001,34.329799999999999,34,2,958,79,52,304,47,91,227,213,170]
[null,"05",12,5663,"P.S. PUÑUN",1782,null,882.35730000000012,899.64269999999988,null,4.9514999999999993,5.0485000000000007,1.9805999999999999,2.0194000000000001,5.44665,5.55335,1.4854499999999999,1.5145500000000001,4.9514999999999993,5.0485000000000007,55.456800000000001,56.543199999999999,80.70944999999999,82.29055000000001,52.485900000000001,53.514099999999999,34.165349999999997,34.834650000000003,48.524699999999996,49.475300000000004,39.611999999999995,40.388000000000005,60.903449999999999,62.096550000000001,61.893749999999997,63.106250000000003,53.971350000000001,55.028649999999999,72.787049999999994,74.212950000000006,58.922849999999997,60.077150000000003,58.922849999999997,60.077150000000003,50.010149999999996,50.989850000000004,65.854950000000002,67.145049999999998,35.650799999999997,36.349200000000003,33.670200000000001,34.329799999999999,34,2,958,79,52,304,47,91,227,213,170]
[150805,null,13,150805,"DISTRITO HUALMAY",30403,null,15054.045450000001,15348.954549999999,null,215.39024999999998,219.60975000000002,195.58425,199.41575,210.43875,214.56125,208.45814999999999,212.54185000000001,270.3519,275.6481,1224.0108,1247.9892,1355.2255499999999,1381.7744500000001,1286.3996999999999,1311.6003000000001,1263.1276499999999,1287.8723500000001,1210.64175,1234.35825,1023.47505,1043.52495,1063.5822000000001,1084.4177999999999,1059.6209999999999,1080.3790000000001,809.57024999999999,825.42975000000001,776.89035000000001,792.10964999999999,763.5213,778.4787,596.65575000000001,608.34424999999999,522.38324999999998,532.61675000000002,379.28489999999999,386.71510000000001,285.70155,291.29845,333.73109999999997,340.26890000000003,501,40,15369,1339,1295,6596,682,1581,5634,3962,2141]
{"$rows_left_out":74}
{"sheet":"Pobla_EESS","index":2,"n_rows":60,"n_cols":16,"rows_kept":60,"cut":false,"hidden":false,"merged":[[39,4,45,4],[39,11,41,11],[42,11,46,11],[46,4,49,4],[9,4,13,4],[9,11,11,11],[12,11,16,11],[16,3,16,5],[19,10,19,12],[32,3,32,5],[37,3,37,8],[37,10,37,15],[1,3,4,10],[7,3,7,8],[7,10,7,15],[15,3,15,4],[25,4,29,4],[25,11,30,11],[30,4,31,4],[23,3,23,8],[23,10,23,15],[31,10,31,12],[50,4,52,4],[51,11,54,11],[54,3,54,5],[55,11,57,11],[58,10,58,12]]}
[]
[null,null,null,"POBLACIÓN SEGÚN DISTRITOS Y EE.SS - 2019"]
[]
[]
[]
[]
[]
[null,null,null,"SIN MICRORED",null,null,null,null,null,null,"MICRORED HUALMAY"]
[null,null,null,"DISTRITO","POBLACIÓN","EE.SS","POBLACIÓN","MASCULINO","FEMENINO",null,"DISTRITO","POBLACIÓN","EE.SS","POBLACIÓN","MASCULINO","FEMENINO"]
[null,null,null,"HUACHO",{"$f":"G10","v":46907},"HOSPITAL HUACHO",{"$f":"VLOOKUP($F10,Poblacion!$E$8:$I$87,2,FALSE)","v":46907},{"$f":"VLOOKUP($F10,Poblacion!$E$8:$I$87,4,FALSE)","v":23226.001049999992},{"$f":"VLOOKUP($F10,Poblacion!$E$8:$I$87,5,FALSE)","v":23680.998950000008},null,"HUALMAY",{"$f":"SUM(N10:N12)","v":30403},"C.S. HUALMAY",{"$f":"VLOOKUP($M10,Poblacion!$E$8:$I$87,2,FALSE)","v":15202},{"$f":"VLOOKUP($M10,Poblacion!$E$8:$I$87,4,FALSE)","v":7527.2702999999983},{"$f":"VLOOKUP($M10,Poblacion!$E$8:$I$87,5,FALSE)","v":7674.7297000000017}]
[null,null,null,"HUACHO",null,"CLINICA SAN PEDRO",0,null,null,null,"HUALMAY",null,"P.S. DGO. MANDAMIENTO",{"$f":"VLOOKUP($M11,Poblacion!$E$8:$I$87,2,FALSE)","v":10641},{"$f":"VLOOKUP($M11,Poblacion!$E$8:$I$87,4,FALSE)","v":5268.8911500000013},{"$f":"VLOOKUP($M11,Poblacion!$E$8:$I$87,5,FALSE)","v":5372.1088499999987}]
[null,null,null,"HUACHO",null,"ESSALUD GUSTAVO LA NATA",0,null,null,null,"HUALMAY",null,"P.S. CAMPO ALEGRE",{"$f":"VLOOKUP($M12,Poblacion!$E$8:$I$87,2,FALSE)","v":4560},{"$f":"VLOOKUP($M12,Poblacion!$E$8:$I$87,4,FALSE)","v":2257.884},{"$f":"VLOOKUP($M12,Poblacion!$E$8:$I$87,5,FALSE)","v":2302.116}]
[null,null,null,"HUACHO",null,"CLINICA SAN BARTOLOME",0,null,null,null,"S.MARIA",{"$f":"SUM(N13:N17)","v":35882},"C.S. SANTA MARIA",{"$f":"VLOOKUP($M13,Poblacion!$E$8:$I$87,2,FALSE)","v":10047},{"$f":"VLOOKUP($M13,Poblacion!$E$8:$I$87,4,FALSE)","v":4974.7720500000005},{"$f":"VLOOKUP($M13,Poblacion!$E$8:$I$87,5,FALSE)","v":5072.2279499999995}]
[null,null,null,"HUACHO",null,"GOLD ESTANDAR EIRL.",0,null,null,null,"S.MARIA",null,"P.S. CHONTA",{"$f":"VLOOKUP($M14,Poblacion!$E$8:$I$87,2,FALSE)","v":5382},{"$f":"VLOOKUP($M14,Poblacion!$E$8:$I$87,4,FALSE)","v":2664.8973000000001},{"$f":"VLOOKUP($M14,Poblacion!$E$8:$I$87,5,FALSE)","v":2717.1026999999999}]
[null,null,null,"CARQUIN",null,"INSITUTO NACIONAL PENITENCIARIO CARQUIN",0,null,null,null,"S.MARIA",null,"P.S. 1RO DE MAYO",{"$f":"VLOOKUP($M15,Poblacion!$E$8:$I$87,2,FALSE)","v":2871},{"$f":"VLOOKUP($M15,Poblacion!$E$8:$I$87,4,FALSE)","v":1421.5756499999995},{"$f":"VLOOKUP($M15,Poblacion!$E$8:$I$87,5,FALSE)","v":1449.4243500000005}]
[null,null,null,null,null,"OTROS ESTABLECIMIENTOS",0,null,null,null,"S.MARIA",null,"P.S. ZAPATA",{"$f":"VLOOKUP($M16,Poblacion!$E$8:$I$87,2,FALSE)","v":10406},{"$f":"VLOOKUP($M16,Poblacion!$E$8:$I$87,4,FALSE)","v":5152.5309000000007},{"$f":"VLOOKUP($M16,Poblacion!$E$8:$I$87,5,FALSE)","v":5253.4690999999993}]
[null,null,null,"TOTAL SIN MICRORED",null,null,{"$f":"SUM(G10:G16)","v":46907},{"$f":"SUM(H10:H16)","v":23226.001049999992},{"$f":"SUM(I10:I16)","v":23680.998950000008},null,"S.MARIA",null,"P.S. SAN BARTOLOME",{"$f":"VLOOKUP($M17,Poblacion!$E$8:$I$87,2,FALSE)","v":7176},{"$f":"VLOOKUP($M17,Poblacion!$E$8:$I$87,4,FALSE)","v":3553.1963999999998},{"$f":"VLOOKUP($M17,Poblacion!$E$8:$I$87,5,FALSE)","v":3622.8036000000002}]
[null,null,null,"Elaboración: Área de Estadística - RIS Huaura Oyón.",null,null,null,null,null,null,"CARQUIN",{"$f":"N18","v":7095},"P.S. CARQUIN",{"$f":"VLOOKUP($M18,Poblacion!$E$8:$I$87,2,FALSE)","v":7095},{"$f":"VLOOKUP($M18,Poblacion!$E$8:$I$87,4,FALSE)","v":3513.0892499999995},{"$f":"VLOOKUP($M18,Poblacion!$E$8:$I$87,5,FALSE)","v":3581.9107500000005}]
[null,null,null,null,null,null,null,null,null,null,"HUACHO",{"$f":"N19","v":15636},"C.S. MANZANARES",{"$f":"VLOOKUP($M19,Poblacion!$E$8:$I$87,2,FALSE)","v":15636},{"$f":"VLOOKUP($M19,Poblacion!$E$8:$I$87,4,FALSE)","v":7742.1654000000008},{"$f":"VLOOKUP($M19,Poblacion!$E$8:$I$87,5,FALSE)","v":7893.8345999999992}]
[null,null,null,null,null,null,null,null,null,null,"TOTAL MCR HUALMAY",null,"TOTAL MICRORED HUALMAY",{"$f":"SUM(N10:N19)","v":89016},{"$f":"SUM(O10:O19)","v":44076.272399999994},{"$f":"SUM(P10:P19)","v":44939.727600000006}]
{"$rows_left_out":40}