{"text_format":"1","workbook":"xlsx","n_sheets":3,"sheets":["Interfaz","Poblacion","Pobla_EESS"],"not_rendered":{"charts":0,"images":10,"macros":1,"external_links":1,"defined_names":4,"comments":0,"pivot_tables":0},"unopened":[],"bounds":{"document_bytes":16777216,"sheet_cells":100000,"rows_first":2000,"rows_last":500,"rows_between":2000,"halvings":0,"cell_chars":16384,"cell_head_chars":4096},"cells_cut":0,"cells_raw":0,"read":"whole","date_system":"1900"}

{"sheet":"Interfaz","index":0,"n_rows":27,"n_cols":18,"rows_kept":27,"cut":false,"hidden":false,"merged":[[4,2,7,11],[9,2,11,11]]}
[]
[]
[]
[]
[null,null,"POBLACIÓN ASIGNADA SEGÚN CENSOS INEI - RENIEC - PN - CNV - 2018"]
[]
[]
[]
[]
[null,null,"RED INTEGRADA DE SALUD HUAURA OYÓN "]
[]
[]
[]
[]
[]
[]
[]
[]
[]
[]
{"$rows_left_out":8}
{"sheet":"Poblacion","index":1,"n_rows":93,"n_cols":89,"rows_kept":93,"cut":false,"hidden":false,"merged":[[4,58,6,58],[4,59,4,62],[5,57,6,57],[5,59,6,59],[5,60,6,60],[5,61,6,61],[5,62,6,62],[5,40,5,41],[5,24,5,25],[5,32,5,33],[5,42,5,43],[5,38,5,39],[4,5,6,5],[4,42,4,43],[5,34,5,35],[5,30,5,31],[4,36,4,37],[5,36,5,37],[4,38,4,39],[5,22,5,23],[4,10,4,11],[4,12,4,13],[4,14,4,15],[4,16,4,17],[4,18,4,19],[5,10,5,11],[5,12,5,13],[5,14,5,15],[4,7,6,7],[4,8,6,8],[5,26,5,27],[4,28,4,29],[5,28,5,29],[5,16,5,17],[5,18,5,19],[4,20,4,21],[5,20,5,21],[1,20,1,41],[2,20,2,41],[4,34,4,35],[4,24,4,25],[3,20,3,41],[4,32,4,33],[4,26,4,27],[4,30,4,31],[4,40,4,41],[4,22,4,23],[5,48,5,49],[4,48,4,49],[4,46,4,47],[4,44,4,45],[5,55,6,55],[4,52,6,52],[4,53,6,53],[4,50,4,51],[5,50,5,51],[5,44,5,45],[5,46,5,47],[4,54,6,54],[4,55,4,57],[5,56,6,56]]}
[null,null,1,2,3,4,5,6,7,8,9,10,11,12,13,14,15,16,17,18,19,20,21,22,23,24,25,26,27,28,29,30,31,32,33,34,35,36,37,38,39,40,41,42,43,44,45,46,47,48,49,50,51,54,55,56,57,null,null,null,77,78,79,80,81,82,83,84,85,86,87,88,89,90,91,92,93,94,95,96,97,98,99,106,107,108,109,110,111]
[]
[]
[]
[null,null,"N°",null,"DIRECCION DE SALUD","TOTAL GENERAL",null,"TOTAL MASCULINO","TOTAL FEMENINO",null,"EDAD",null,"EDAD",null,"EDAD",null,"EDAD",null,"EDAD",null,"EDAD",null,"EDAD",null,"EDAD",null,"EDAD",null,"EDAD",null,"EDAD",null,"EDAD",null,"EDAD",null,"EDAD",null,"EDAD",null,"EDAD",null,"EDAD",null,"EDAD",null,"EDAD",null,"EDAD",null,"EDAD",null,"NACIMIENTOS","28 DIAS DE NACIDO","POB.FEM. TOTAL","POB.FEMENINA",null,null,"GESTANTES","OTRO GRUPOS ESPECIFICOS EN POBLACION FEMENINA"]
["UBIGEO",null,null,null,"PROVINCIA",null,null,null,null,null,0,null,1,null,2,null,3,null,4,null,"5 - 9",null,"10 - 14",null,"15 - 19",null,"20 - 24",null,"25 - 29",null,"30 - 34",null,"35 - 39",null,"40 - 44 ",null,"45 - 49",null,"50 - 54 ",null,"55 - 59 ",null,"60 - 64",null,"65 - 69 ",null,"70- 74 ",null,"75 - 79 ",null,"80 - +",null,null,null,null,"10 - 14 Años","15 - 19 Años","20 - 49 Años",null,"12 - 17 Años","20 - 44 Años","30 - 49 Años","50 - 64 Años"]
[null,"Microredes",null,"RENAES","DISTRITO",null,null,null,null,null,"M","F","M","F","M","F","M","F","M","F","M","F","M","F","M","F","M","F","M","F","M","F","M","F","M","F","M","F","M","F","M","F","M","F","M","F","M","F","M","F","M","F"]
[150000,null,1,null,"HUAURA - OYON",253637,null,125588.36055,128048.63945,null,1854.8318999999999,1891.1681000000001,2145.48495,2187.51505,2089.0378500000002,2129.9621499999998,1843.9386,1880.0614,1980.1048499999997,2018.8951500000003,10264.95465,10466.04535,11560.762199999999,11787.237800000001,11012.136,11227.864,10656.123150000001,10864.876849999999,9944.5925999999999,10139.4074,8657.2025999999987,8826.7974000000013,8857.7383499999996,9031.2616500000004,8189.2858499999993,8349.7141499999998,7045.4893499999998,7183.5106500000002,6431.0081999999993,6556.9918000000007,5864.0614500000001,5978.9385499999999,4799.9840999999997,4894.0159000000003,4069.1426999999999,4148.8572999999997,3377.4181499999995,3443.5818500000005,2366.3218500000003,2412.6781499999997,2578.7411999999999,2629.2588000000001,4408,342,130608,11457,11133,55574,6005,13566,46698,33032,17289]
[150800,null,2,150800,"PROVINCIA HUAURA",230083,null,113925.59744999999,116157.40255000001,null,1757.2873499999998,1791.7126500000002,2021.6974499999999,2061.3025499999999,1962.7746,2001.2254,1738.9667999999999,1773.0332000000001,1848.3949499999999,1884.6050500000001,9121.1581499999993,9299.8418500000007,10306.052099999999,10507.947900000001,10050.554699999999,10247.445300000001,9739.6005000000005,9930.3994999999995,8956.2731999999996,9131.7268000000004,7788.2143499999993,7940.7856500000007,7911.5066999999999,8066.4933000000001,7441.1142,7586.8858,6380.5028999999995,6505.4971000000005,5883.8674499999997,5999.1325500000003,5376.83385,5482.16615,4418.2234499999995,4504.7765500000005,3675.49845,3747.50155,3061.5124499999997,3121.4875500000003,2118.74685,2160.25315,2366.817,2413.183,3864,303,117765,10207,10157,50206,5261,12261,42202,29815,15884]
[150801,null,3,150802,"DISTRITO HUACHO",63662,null,31522.239299999997,32139.760700000003,null,682.81184999999994,696.18815000000006,743.71529999999996,758.28470000000004,830.36654999999996,846.63345000000004,424.83869999999996,433.16130000000004,541.19894999999997,551.80105000000003,2220.2525999999998,2263.7474000000002,2488.1287499999999,2536.8712500000001,2473.7693999999997,2522.2306000000003,2503.4784,2552.5216,2310.3698999999997,2355.6301000000003,2021.2022999999999,2060.7977000000001,2130.6304500000001,2172.3695499999999,2083.0960500000001,2123.9039499999999,1838.9870999999998,1875.0129000000002,1819.1811,1854.8189,1633.4998499999999,1665.5001500000001,1313.6329499999999,1339.3670500000001,1111.61175,1133.38825,928.90139999999997,947.09860000000003,669.44279999999992,682.55720000000008,753.12315000000001,767.87684999999999,928,73,31468,2454,2489,13372,1263,2981,11375,8278,4974]
[null,"00",4,7639,"HOSPITAL HUACHO",47747,null,23641.927049999998,24105.072949999998,null,511.98509999999999,522.01490000000001,557.53890000000001,568.46109999999999,622.89869999999996,635.10130000000004,318.8766,325.1234,406.02299999999997,413.97700000000003,1665.1894499999999,1697.8105500000001,1866.2203499999998,1902.7796500000002,1855.3270499999999,1891.6729500000001,1877.6088,1914.3912,1733.0249999999999,1766.9750000000001,1515.6541499999998,1545.3458500000002,1597.84905,1629.15095,1562.1982499999999,1592.8017500000001,1378.9927499999999,1406.0072500000001,1364.6333999999999,1391.3666000000001,1225.0011,1248.9989,985.34849999999994,1004.6515000000001,833.83259999999996,850.16740000000004,696.67604999999992,710.32395000000008,502.08209999999997,511.91790000000003,564.96614999999997,576.03385000000003,696,55,23601,1840,1867,10029,947,2237,8532,6208,3729]
[null,"02",5,5679,"C.S. MANZANARES",15915,null,7880.3122499999999,8034.6877500000001,null,170.82675,174.17325,186.1764,189.8236,207.46785,211.53215,105.96209999999999,108.03790000000001,135.17595,137.82405,555.06314999999995,565.93685000000005,621.90840000000003,634.09159999999997,618.44234999999992,630.55765000000008,625.86959999999999,638.13040000000001,577.34489999999994,588.65510000000006,505.54814999999996,515.45185000000004,532.78139999999996,543.21860000000004,520.89779999999996,531.10220000000004,459.99435,469.00565,454.54769999999996,463.45230000000004,408.49874999999997,416.50125000000003,328.28444999999999,334.71555000000001,277.77915000000002,283.22084999999998,232.22534999999999,236.77465000000001,167.36069999999998,170.63930000000002,188.15699999999998,191.84300000000002,232,18,7867,614,622,3343,316,744,2843,2070,1245]
[150802,null,6,150802,"DISTRITO AMBAR",2751,null,1362.1576500000001,1388.8423499999999,null,18.8157,19.1843,20.796299999999999,21.203700000000001,21.291449999999998,21.708550000000002,11.388449999999999,11.611550000000001,20.30115,20.69885,153.00135,155.99865,150.5256,153.4744,103.9815,106.0185,108.93299999999999,111.06700000000001,90.612449999999995,92.387550000000005,83.185199999999995,84.814800000000005,83.185199999999995,84.814800000000005,74.272499999999994,75.727500000000006,79.22399999999999,80.77600000000001,72.291899999999998,73.708100000000002,63.379199999999997,64.620800000000003,57.932549999999999,59.067450000000001,53.476199999999999,54.523800000000001,38.621699999999997,39.378300000000003,25.747799999999998,26.252200000000002,31.19445,31.80555,44,3,1472,149,105,544,60,151,421,295,174]
[null,"01",7,5680,"C.S. AMBAR",1652,null,817.98779999999999,834.01220000000001,null,11.388449999999999,11.611550000000001,12.37875,12.62125,12.873899999999999,13.126100000000001,6.9321000000000002,7.0678999999999998,12.37875,12.62125,91.60275,93.39725,90.1173,91.8827,62.3889,63.6111,65.359799999999993,66.640200000000007,54.466499999999996,55.533500000000004,50.010149999999996,50.989850000000004,50.010149999999996,50.989850000000004,44.563499999999998,45.436500000000002,47.534399999999998,48.465600000000002,43.5732,44.4268,38.126550000000002,38.873449999999998,34.660499999999999,35.339500000000001,32.184750000000001,32.815249999999999,23.27205,23.72795,15.349649999999999,15.650350000000001,18.8157,19.1843,26,2,883,89,63,326,36,91,252,176,105]
[null,"01",8,5681,"P.S. AYNACA",1099,null,544.16984999999988,554.83015000000012,null,7.4272499999999999,7.5727500000000001,8.4175500000000003,8.5824499999999997,8.4175500000000003,8.5824499999999997,4.4563499999999996,4.5436500000000004,7.9223999999999997,8.0776000000000003,61.398599999999995,62.601400000000005,60.408299999999997,61.591700000000003,41.592599999999997,42.407400000000003,43.5732,44.4268,36.145949999999999,36.854050000000001,33.175049999999999,33.824950000000001,33.175049999999999,33.824950000000001,29.709,30.291,31.689599999999999,32.310400000000001,28.718699999999998,29.281300000000002,25.252649999999999,25.747350000000001,23.27205,23.72795,21.291449999999998,21.708550000000002,15.349649999999999,15.650350000000001,10.398149999999999,10.601850000000001,12.37875,12.62125,18,1,589,60,42,218,24,60,169,119,69]
[150803,null,9,150803,"DISTRITO CARQUIN",7011,null,3471.49665,3539.50335,null,41.592599999999997,42.407400000000003,53.476199999999999,54.523800000000001,41.592599999999997,42.407400000000003,54.961649999999999,56.038350000000001,45.553799999999995,46.446200000000005,273.81795,279.18205,277.28399999999999,282.71600000000001,283.22579999999999,288.77420000000001,327.78929999999997,334.21070000000003,326.30385000000001,332.69614999999999,291.14819999999997,296.85180000000003,254.01194999999998,258.98804999999999,260.94405,266.05595,187.16669999999999,190.83330000000001,183.70065,187.29935,157.45769999999999,160.54230000000001,121.31174999999999,123.68825000000001,113.88449999999999,116.11550000000001,77.243399999999994,78.756600000000006,45.553799999999995,46.446200000000005,53.476199999999999,54.523800000000001,129,10,3655,275,287,1715,176,337,1438,971,452]
[null,"02",10,5664,"P.S. CARQUIN",7011,null,3471.49665,3539.50335,null,41.592599999999997,42.407400000000003,53.476199999999999,54.523800000000001,41.592599999999997,42.407400000000003,54.961649999999999,56.038350000000001,45.553799999999995,46.446200000000005,273.81795,279.18205,277.28399999999999,282.71600000000001,283.22579999999999,288.77420000000001,327.78929999999997,334.21070000000003,326.30385000000001,332.69614999999999,291.14819999999997,296.85180000000003,254.01194999999998,258.98804999999999,260.94405,266.05595,187.16669999999999,190.83330000000001,183.70065,187.29935,157.45769999999999,160.54230000000001,121.31174999999999,123.68825000000001,113.88449999999999,116.11550000000001,77.243399999999994,78.756600000000006,45.553799999999995,46.446200000000005,53.476199999999999,54.523800000000001,129,10,3655,275,287,1715,176,337,1438,971,452]
[150804,null,11,150804,"DISTRITO CHECRAS",1751,null,867.00765000000001,883.9923500000001,null,1.9805999999999999,2.0194000000000001,3.9611999999999998,4.0388000000000002,1.9805999999999999,2.0194000000000001,4.9514999999999993,5.0485000000000007,1.9805999999999999,2.0194000000000001,58.427699999999994,59.572300000000006,80.70944999999999,82.29055000000001,52.485900000000001,53.514099999999999,34.660499999999999,35.339500000000001,47.039249999999996,47.960750000000004,39.611999999999995,40.388000000000005,60.903449999999999,62.096550000000001,59.913149999999995,61.086850000000005,53.476199999999999,54.523800000000001,71.796750000000003,73.203249999999997,56.942249999999994,58.057750000000006,57.437399999999997,58.562600000000003,48.02955,48.97045,63.87435,65.125650000000007,34.660499999999999,35.339500000000001,32.184750000000001,32.815249999999999,34,2,958,79,52,304,47,91,227,213,170]
[null,"05",12,5663,"P.S. PUÑUN",1751,null,867.00765000000001,883.9923500000001,null,1.9805999999999999,2.0194000000000001,3.9611999999999998,4.0388000000000002,1.9805999999999999,2.0194000000000001,4.9514999999999993,5.0485000000000007,1.9805999999999999,2.0194000000000001,58.427699999999994,59.572300000000006,80.70944999999999,82.29055000000001,52.485900000000001,53.514099999999999,34.660499999999999,35.339500000000001,47.039249999999996,47.960750000000004,39.611999999999995,40.388000000000005,60.903449999999999,62.096550000000001,59.913149999999995,61.086850000000005,53.476199999999999,54.523800000000001,71.796750000000003,73.203249999999997,56.942249999999994,58.057750000000006,57.437399999999997,58.562600000000003,48.02955,48.97045,63.87435,65.125650000000007,34.660499999999999,35.339500000000001,32.184750000000001,32.815249999999999,34,2,958,79,52,304,47,91,227,213,170]
[150805,null,13,150805,"DISTRITO HUALMAY",29796,null,14753.4894,15042.5106,null,175.77824999999999,179.22175000000001,195.58425,199.41575,177.2637,180.7363,249.06045,253.93955,264.4101,269.5899,1187.3697,1210.6303,1352.7498000000001,1379.2501999999999,1281.94335,1307.05665,1267.5839999999998,1292.4160000000002,1168.0588499999999,1190.9411500000001,1021.9896,1042.0104000000001,1060.1161500000001,1080.8838499999999,1020.0089999999999,1039.991,799.66724999999997,815.33275000000003,764.01644999999996,778.98355000000004,730.84140000000002,745.15859999999998,576.84974999999997,588.15025000000003,500.10149999999999,509.89850000000001,364.92554999999999,372.07445000000001,276.78884999999997,282.21115000000003,318.38144999999997,324.61855000000003,501,40,15369,1339,1295,6596,682,1581,5634,3962,2141]
{"$rows_left_out":74}
{"sheet":"Pobla_EESS","index":2,"n_rows":60,"n_cols":16,"rows_kept":60,"cut":false,"hidden":false,"merged":[[50,4,52,4],[51,11,54,11],[54,3,54,5],[55,11,57,11],[58,10,58,12],[1,3,4,10],[7,3,7,8],[7,10,7,15],[15,3,15,4],[25,4,29,4],[25,11,30,11],[30,4,31,4],[23,3,23,8],[23,10,23,15],[31,10,31,12],[39,4,45,4],[39,11,41,11],[42,11,46,11],[46,4,49,4],[9,4,13,4],[9,11,11,11],[12,11,16,11],[16,3,16,5],[19,10,19,12],[32,3,32,5],[37,3,37,8],[37,10,37,15]]}
[]
[null,null,null,"POBLACIÓN SEGÚN DISTRITOS Y EE.SS - 2018"]
[]
[]
[]
[]
[]
[null,null,null,"SIN MICRORED",null,null,null,null,null,null,"MICRORED HUALMAY"]
[null,null,null,"DISTRITO","POBLACIÓN","EE.SS","POBLACIÓN","MASCULINO","FEMENINO",null,"DISTRITO","POBLACIÓN","EE.SS","POBLACIÓN","MASCULINO","FEMENINO"]
[null,null,null,"HUACHO",{"$f":"G10","v":47747},"HOSPITAL HUACHO",{"$f":"VLOOKUP($F10,Poblacion!$E$8:$I$87,2,FALSE)","v":47747},{"$f":"VLOOKUP($F10,Poblacion!$E$8:$I$87,4,FALSE)","v":23641.927049999998},{"$f":"VLOOKUP($F10,Poblacion!$E$8:$I$87,5,FALSE)","v":24105.072949999998},null,"HUALMAY",{"$f":"SUM(M10:M12)","v":0},"C.S. HUALMAY",{"$f":"VLOOKUP($M10,Poblacion!$E$8:$I$87,2,FALSE)","v":14898},{"$f":"VLOOKUP($M10,Poblacion!$E$8:$I$87,4,FALSE)","v":7376.7446999999993},{"$f":"VLOOKUP($M10,Poblacion!$E$8:$I$87,5,FALSE)","v":7521.2553000000016}]
[null,null,null,"HUACHO",null,"CLINICA SAN PEDRO",0,null,null,null,"HUALMAY",null,"P.S. DGO. MANDAMIENTO",{"$f":"VLOOKUP($M11,Poblacion!$E$8:$I$87,2,FALSE)","v":10429},{"$f":"VLOOKUP($M11,Poblacion!$E$8:$I$87,4,FALSE)","v":5163.9193499999992},{"$f":"VLOOKUP($M11,Poblacion!$E$8:$I$87,5,FALSE)","v":5265.0806500000008}]
[null,null,null,"HUACHO",null,"ESSALUD GUSTAVO LA NATA",0,null,null,null,"HUALMAY",null,"P.S. CAMPO ALEGRE",{"$f":"VLOOKUP($M12,Poblacion!$E$8:$I$87,2,FALSE)","v":4469},{"$f":"VLOOKUP($M12,Poblacion!$E$8:$I$87,4,FALSE)","v":2212.8253500000001},{"$f":"VLOOKUP($M12,Poblacion!$E$8:$I$87,5,FALSE)","v":2256.1746499999999}]
[null,null,null,"HUACHO",null,"CLINICA SAN BARTOLOME",0,null,null,null,"S.MARIA",{"$f":"SUM(M13:M17)","v":0},"C.S. SANTA MARIA",{"$f":"VLOOKUP($M13,Poblacion!$E$8:$I$87,2,FALSE)","v":9796},{"$f":"VLOOKUP($M13,Poblacion!$E$8:$I$87,4,FALSE)","v":4850.4894000000004},{"$f":"VLOOKUP($M13,Poblacion!$E$8:$I$87,5,FALSE)","v":4945.5105999999996}]
[null,null,null,"HUACHO",null,"GOLD ESTANDAR EIRL.",0,null,null,null,"S.MARIA",null,"P.S. CHONTA",{"$f":"VLOOKUP($M14,Poblacion!$E$8:$I$87,2,FALSE)","v":5248},{"$f":"VLOOKUP($M14,Poblacion!$E$8:$I$87,4,FALSE)","v":2598.5472000000009},{"$f":"VLOOKUP($M14,Poblacion!$E$8:$I$87,5,FALSE)","v":2649.4527999999991}]
[null,null,null,"CARQUIN",null,"INSITUTO NACIONAL PENITENCIARIO CARQUIN",0,null,null,null,"S.MARIA",null,"P.S. 1RO DE MAYO",{"$f":"VLOOKUP($M15,Poblacion!$E$8:$I$87,2,FALSE)","v":2799},{"$f":"VLOOKUP($M15,Poblacion!$E$8:$I$87,4,FALSE)","v":1385.9248500000001},{"$f":"VLOOKUP($M15,Poblacion!$E$8:$I$87,5,FALSE)","v":1413.0751499999999}]
[null,null,null,null,null,"OTROS ESTABLECIMIENTOS",0,null,null,null,"S.MARIA",null,"P.S. ZAPATA",{"$f":"VLOOKUP($M16,Poblacion!$E$8:$I$87,2,FALSE)","v":9796},{"$f":"VLOOKUP($M16,Poblacion!$E$8:$I$87,4,FALSE)","v":4850.4894000000004},{"$f":"VLOOKUP($M16,Poblacion!$E$8:$I$87,5,FALSE)","v":4945.5105999999996}]
[null,null,null,"TOTAL SIN MICRORED",null,null,{"$f":"SUM(G10:G16)","v":47747},{"$f":"SUM(H10:H16)","v":23641.927049999998},{"$f":"SUM(I10:I16)","v":24105.072949999998},null,"S.MARIA",null,"P.S. SAN BARTOLOME",{"$f":"VLOOKUP($M17,Poblacion!$E$8:$I$87,2,FALSE)","v":7347},{"$f":"VLOOKUP($M17,Poblacion!$E$8:$I$87,4,FALSE)","v":3637.8670499999998},{"$f":"VLOOKUP($M17,Poblacion!$E$8:$I$87,5,FALSE)","v":3709.1329500000002}]
[null,null,null,"Elaboración: Área de Estadística - RIS Huaura Oyón.",null,null,null,null,null,null,"CARQUIN",{"$f":"N18","v":7011},"P.S. CARQUIN",{"$f":"VLOOKUP($M18,Poblacion!$E$8:$I$87,2,FALSE)","v":7011},{"$f":"VLOOKUP($M18,Poblacion!$E$8:$I$87,4,FALSE)","v":3471.49665},{"$f":"VLOOKUP($M18,Poblacion!$E$8:$I$87,5,FALSE)","v":3539.50335}]
[null,null,null,null,null,null,null,null,null,null,"HUACHO",{"$f":"SUM(N19)","v":15915},"C.S. MANZANARES",{"$f":"VLOOKUP($M19,Poblacion!$E$8:$I$87,2,FALSE)","v":15915},{"$f":"VLOOKUP($M19,Poblacion!$E$8:$I$87,4,FALSE)","v":7880.3122499999999},{"$f":"VLOOKUP($M19,Poblacion!$E$8:$I$87,5,FALSE)","v":8034.6877500000001}]
[null,null,null,null,null,null,null,null,null,null,"TOTAL MCR HUALMAY",null,"TOTAL MICRORED HUALMAY",{"$f":"SUM(N10:N19)","v":87708},{"$f":"SUM(O10:O19)","v":43428.616200000004},{"$f":"SUM(P10:P19)","v":44279.383799999996}]
{"$rows_left_out":40}