{"text_format":"1","workbook":"xlsx","n_sheets":4,"sheets":["Interfaz","Poblacion","etapas y mredes","Pobla_EESS"],"not_rendered":{"charts":1,"images":13,"macros":1,"external_links":1,"defined_names":4,"comments":0,"pivot_tables":0},"unopened":[],"bounds":{"document_bytes":16777216,"sheet_cells":100000,"rows_first":2000,"rows_last":500,"rows_between":2000,"halvings":0,"cell_chars":16384,"cell_head_chars":4096},"cells_cut":0,"cells_raw":0,"read":"whole","date_system":"1900"}

{"sheet":"Interfaz","index":0,"n_rows":27,"n_cols":18,"rows_kept":27,"cut":false,"hidden":false,"merged":[[4,2,7,11],[9,2,11,11]]}
[]
[]
[]
[]
[null,null,"POBLACIÓN ASIGNADA SEGÚN CENSOS INEI - RENIEC - PN - CNV - 2017"]
[]
[]
[]
[]
[null,null,"RED INTEGRADA DE SALUD HUAURA OYÓN "]
[]
[]
[]
[]
[]
[]
[]
[]
[]
[]
{"$rows_left_out":8}
{"sheet":"Poblacion","index":1,"n_rows":93,"n_cols":126,"rows_kept":93,"cut":false,"hidden":false,"merged":[[4,84,6,84],[4,93,6,93],[2,87,2,94],[4,92,6,92],[4,91,6,91],[4,85,6,85],[4,86,6,86],[4,87,6,87],[4,89,6,89],[4,88,6,88],[5,68,5,69],[5,70,5,71],[5,72,5,73],[4,72,4,73],[4,70,4,71],[4,68,4,69],[4,74,4,75],[5,74,5,75],[4,76,6,76],[4,83,6,83],[4,82,6,82],[4,77,4,80],[5,77,6,77],[5,78,6,78],[5,79,6,79],[5,80,6,80],[1,30,1,65],[2,30,2,65],[4,58,4,59],[4,48,4,49],[3,30,3,65],[4,36,4,37],[4,56,4,57],[4,30,4,31],[4,32,4,33],[4,34,4,35],[4,50,4,51],[4,54,4,55],[4,64,4,65],[4,40,4,41],[4,46,4,47],[4,7,6,7],[4,8,6,8],[5,50,5,51],[4,52,4,53],[5,52,5,53],[4,10,4,11],[5,10,5,11],[4,12,4,13],[4,18,4,19],[4,20,4,21],[4,22,4,23],[4,24,4,25],[4,26,4,27],[5,18,5,19],[5,20,5,21],[5,22,5,23],[4,5,6,5],[4,66,4,67],[5,12,5,13],[4,14,4,15],[5,14,5,15],[5,58,5,59],[5,36,5,37],[4,28,4,29],[5,32,5,33],[5,34,5,35],[5,28,5,29],[5,30,5,31],[5,54,5,55],[4,60,4,61],[5,60,5,61],[4,62,4,63],[5,24,5,25],[5,26,5,27],[4,16,4,17],[5,16,5,17],[4,38,4,39],[5,38,5,39],[5,46,5,47],[5,40,5,41],[4,42,4,43],[4,44,4,45],[5,42,5,43],[5,44,5,45],[5,64,5,65],[5,48,5,49],[5,56,5,57],[5,66,5,67],[5,62,5,63]]}
[null,null,1,2,3,4,5,6,7,8,9,10,11,12,13,14,15,16,17,18,19,20,21,22,23,24,25,26,27,28,29,30,31,32,33,34,35,36,37,38,39,40,41,42,43,44,45,46,47,48,49,50,51,52,53,54,55,56,57,58,59,60,61,62,63,64,65,66,67,68,69,70,71,72,73,74,75,76,77,78,79,80,81,82,83,84,85,86,87,88,89,90,91,92,null,null,null,77,78,79,80,81,82,83,84,85,86,87,88,89,90,91,92,93,94,95,96,97,98,99,106,107,108,109,110,111]
[null,null,null,null,null,null,null,null,null,null,null,null,null,null,null,null,null,null,null,null,null,null,null,null,null,null,null,null,null,null,"POBLACIÓN ESTIMADA POR GRUPOS DE EDAD, SEGÚN PROVINCIAS DISTRITOS Y ESTABLECIMIENTOS DE SALUD"]
[null,null,null,null,null,null,null,null,null,null,null,null,null,null,null,null,null,null,null,null,null,null,null,null,null,null,null,null,null,null,"RED INTEGRADA DE SALUD HUAURA OYON   -   AÑO  2020",null,null,null,null,null,null,null,null,null,null,null,null,null,null,null,null,null,null,null,null,null,null,null,null,null,null,null,null,null,null,null,null,null,null,null,null,null,null,null,null,null,null,null,{"$f":"ROUND(BY3,0)","v":0},null,null,null,null,null,null,null,null,null,null,null,null,"MAS GRUPOS DE EDAD"]
[null,null,null,null,null,null,null,null,null,null,null,null,null,null,null,null,null,null,null,null,null,null,null,null,null,null,null,null,null,null,"EDADES PUNTUALES Y GRUPOS DE EDAD"]
[null,null,"N°",null,"DIRECCION DE SALUD","TOTAL GENERAL",null,"TOTAL MASCULINO","TOTAL FEMENINO",null,"EDAD",null,"EDAD",null,"EDAD",null,"EDAD",null,"EDAD",null,"EDAD",null,"EDAD",null,"EDAD",null,"EDAD",null,"EDAD",null,"EDAD",null,"EDAD",null,"EDAD",null,"EDAD",null,"EDAD",null,"EDAD",null,"EDAD",null,"EDAD",null,"EDAD",null,"EDAD",null,"EDAD",null,"EDAD",null,"EDAD",null,"EDAD",null,"EDAD",null,"EDAD",null,"EDAD",null,"EDAD",null,"EDAD",null,"EDAD",null,"EDAD",null,"EDAD",null,"EDAD",null,"NACIMIENTOS","POBLACION FEMENINA",null,null,null,null,"menor de 1 Año","Pre escolar         (1-4)","Niño             (0 - 11)","Escolar               (05 - 17)","Adolescente (12 - 17)","Adulto Joven (18 - 29)","Adulto            (30-59)","Adu.Mayor (60 a MAS)",null,"Escolar               (05 - 09)","Adolescente (10 - 19)","Adulto            (20-59)"]
["UBIGEO",null,null,null,"PROVINCIA",null,null,null,null,null,0,null,1,null,2,null,3,null,4,null,5,null,6,null,7,null,8,null,9,null,10,null,11,null,12,null,13,null,14,null,15,null,16,null,17,null,18,null,19,null,"20 - 24",null,"25 - 29",null,"30 - 34",null,"35 - 39",null,"40 - 44 ",null,"45 - 49",null,"50 - 54 ",null,"55 - 59 ",null,"60 - 64",null,"65 - 69 ",null,"70- 74 ",null,"75 - 79 ",null,"80 - +",null,null,"10-14","15-19","20-49","GESTANTE"]
[null,"Microredes",null,"RENAES","DISTRITO",null,null,null,null,null,"M","F","M","F","M","F","M","F","M","F","M","F","M","F","M","F","M","F","M","F","M","F","M","F","M","F","M","F","M","F","M","F","M","F","M","F","M","F","M","F","M","F","M","F","M","F","M","F","M","F","M","F","M","F","M","F","M","F","M","F","M","F","M","F","M","F"]
[150000,null,1,null,"HUAURA - OYON",252031,null,126566,125465,null,2243,2172,2169,2111,1992,1860,2104,2097,2065,1943,2039,1889,2238,2143,2402,2236,2280,2225,2130,2063,2151,2185,2121,2042,2043,1998,2070,1928,1926,1923,1866,1774,1919,1864,2034,1943,2004,1932,2229,2137,11368,11227,10269,10375,9773,9781,8964,8829,8227,8297,7318,7371,6453,6576,5519,5460,4606,4643,3820,3755,2968,2991,2271,2310,2985,3385,5061,10076,9650,55880,5947,null,{"$f":"SUM(K8:L8)","v":4415},{"$f":"SUM(M8:T8)","v":16341},{"$f":"SUM(K8:AH8)","v":50900},{"$f":"SUM(U8:AT8)","v":53432},{"$f":"SUM(AI8:AT8)","v":23288},{"$f":"SUM(AU8:BB8)","v":51541},{"$f":"SUM(BC8:BN8)","v":92568},{"$f":"SUM(BO8:BX8)","v":33734},null,{"$f":"SUM(U8:AD8)","v":21645},{"$f":"SUM(AE8:AX8)","v":40089},{"$f":"SUM(AY8:BN8)","v":135807}]
[150800,null,2,150800,"PROVINCIA HUAURA",231741,null,116378,115363,null,2107,2072,2019,1974,1859,1736,1949,1919,1868,1783,1846,1697,2030,1944,2183,1998,2050,1996,1941,1854,1917,1950,1907,1801,1838,1799,1846,1727,1724,1724,1672,1581,1712,1674,1848,1788,1816,1763,2058,1979,10480,10349,9527,9617,9063,9060,8366,8265,7606,7731,6771,6820,5951,6080,5062,5036,4251,4305,3510,3478,2753,2720,2084,2094,2764,3049,4559,9001,8785,51842,5207,null,{"$f":"SUM(K9:L9)","v":4179},{"$f":"SUM(M9:T9)","v":15107},{"$f":"SUM(K9:AH9)","v":46400},{"$f":"SUM(U9:AT9)","v":48047},{"$f":"SUM(AI9:AT9)","v":20933},{"$f":"SUM(AU9:BB9)","v":47589},{"$f":"SUM(BC9:BN9)","v":85811},{"$f":"SUM(BO9:BX9)","v":31008},null,19539,36124,125784]
[150801,null,3,150802,"DISTRITO HUACHO",69564,null,34217,35347,null,962,954,773,746,502,448,580,602,658,623,656,642,546,488,535,521,520,537,483,497,496,535,490,483,483,500,507,447,455,444,448,444,439,437,498,461,471,477,536,508,2661,2834,2512,2646,2519,2542,2428,2472,2252,2372,2130,2235,1910,2052,1665,1781,1455,1545,1143,1268,869,926,731,755,904,1125,1200,2409,2327,15101,1249,null,1916,4932,14277,12992,5563,12645,26358,10721,null,5425,9559,37011]
[null,"00",4,7639,"HOSPITAL HUACHO",52173,null,25663,26510,null,721,716,580,559,376,336,435,451,493,468,492,481,409,366,401,391,390,403,362,373,372,401,367,363,362,375,380,336,341,333,336,333,329,328,373,346,353,358,402,381,1995,2126,1884,1984,1888,1906,1820,1854,1689,1779,1598,1675,1433,1538,1249,1336,1092,1158,858,951,653,695,549,567,681,843,900,1808,1746,11324,937,null,1437,3698,10706,9743,4172,9483,19765,8047,null,4068,7169,27754]
[null,"02",5,5679,"C.S. MANZANARES",17391,null,8554,8837,null,241,238,193,187,126,112,145,151,165,155,164,161,137,122,134,130,130,134,121,124,124,134,123,120,121,125,127,111,114,111,112,111,110,109,125,115,118,119,134,127,666,708,628,662,631,636,608,618,563,593,532,560,477,514,416,445,363,387,285,317,216,231,182,188,223,282,300,601,581,3777,312,null,479,1234,3571,3249,1391,3162,6593,2674,null,1357,2390,9257]
[150802,null,6,150802,"DISTRITO AMBAR",2210,null,1197,1013,null,24,16,29,16,18,12,29,15,24,21,16,21,21,18,25,16,22,17,18,19,15,22,19,10,19,21,22,14,21,28,23,19,24,26,14,15,25,18,28,12,102,103,66,72,78,78,67,43,73,52,55,56,75,46,53,54,50,42,44,23,43,14,19,29,36,45,40,95,90,404,60,null,40,164,463,505,246,426,730,345,null,193,395,1073]
[null,"01",7,5680,"C.S. AMBAR",1323,null,718,605,null,14,10,17,10,11,7,17,9,14,13,10,12,13,10,15,10,13,10,11,11,9,13,11,6,11,13,13,9,13,16,14,11,14,16,8,9,15,11,17,7,62,62,39,44,46,47,41,24,44,31,33,34,45,27,31,33,30,25,26,15,26,8,12,16,23,26,24,57,54,242,36,null,24,98,276,301,147,257,436,207,null,115,236,643]
[null,"01",8,5681,"P.S. AYNACA",887,null,479,408,null,10,6,12,6,7,5,12,6,10,8,6,9,8,8,10,6,9,7,7,8,6,9,8,4,8,8,9,5,8,12,9,8,10,10,6,6,10,7,11,5,40,41,27,28,32,31,26,19,29,21,22,22,30,19,22,21,20,17,18,8,17,6,7,13,13,19,16,38,36,162,24,null,16,66,187,204,99,169,294,138,null,78,159,430]
[150803,null,9,150803,"DISTRITO CARQUIN",6380,null,3285,3095,null,39,42,34,44,40,38,50,37,42,41,40,41,70,61,65,51,78,63,55,60,65,58,66,64,55,56,42,40,45,46,51,54,54,61,52,42,52,41,54,50,282,259,263,270,271,246,252,258,227,199,192,180,173,170,147,120,113,116,103,93,73,73,76,54,64,67,127,264,248,1412,174,null,81,326,1244,1435,598,1271,2435,832,null,584,1048,3509]
[null,"02",10,5664,"P.S. CARQUIN",6380,null,3285,3095,null,39,42,34,44,40,38,50,37,42,41,40,41,70,61,65,51,78,63,55,60,65,58,66,64,55,56,42,40,45,46,51,54,54,61,52,42,52,41,54,50,282,259,263,270,271,246,252,258,227,199,192,180,173,170,147,120,113,116,103,93,73,73,76,54,64,67,127,264,248,1412,174,null,81,326,1244,1435,598,1271,2435,832,null,584,1048,3509]
[150804,null,11,150804,"DISTRITO CHECRAS",1018,null,501,517,null,2,3,3,1,2,1,2,1,1,0,5,0,8,9,7,11,14,7,11,7,6,9,20,15,14,9,6,13,11,5,3,9,3,10,8,7,6,4,10,10,35,22,22,25,21,29,22,14,28,21,29,33,43,27,26,24,33,33,29,31,17,26,26,28,28,73,21,51,40,144,47,null,5,11,145,227,98,134,317,324,null,79,178,421]
[null,"05",12,5663,"P.S. PUÑUN",1018,null,501,517,null,2,3,3,1,2,1,2,1,1,0,5,0,8,9,7,11,14,7,11,7,6,9,20,15,14,9,6,13,11,5,3,9,3,10,8,7,6,4,10,10,35,22,22,25,21,29,22,14,28,21,29,33,43,27,26,24,33,33,29,31,17,26,26,28,28,73,21,51,40,144,47,null,5,11,145,227,98,134,317,324,null,79,178,421]
[150805,null,13,150805,"DISTRITO HUALMAY",27960,null,13898,14062,null,174,171,183,200,234,226,254,208,205,219,195,164,216,225,254,245,253,251,230,242,222,226,215,223,220,205,241,211,186,210,197,169,203,220,241,224,232,226,244,254,1314,1315,1216,1178,1109,1199,1039,1053,991,1008,868,793,696,717,557,552,466,533,384,402,321,356,212,263,326,374,573,1075,1093,6546,674,null,345,1729,5235,5688,2527,5979,10582,3637,null,2275,4369,15605]
{"$rows_left_out":74}
{"sheet":"etapas y mredes","index":2,"n_rows":38,"n_cols":21,"rows_kept":38,"cut":false,"hidden":false,"merged":[[25,4,25,5],[30,4,30,5],[29,4,29,5],[28,4,28,5],[27,4,27,5],[26,4,26,5],[35,4,35,5],[34,4,34,5],[33,4,33,5],[32,4,32,5],[31,4,31,5],[6,15,6,20],[6,2,6,11],[1,2,5,12],[36,2,36,3],[35,2,35,3],[34,2,34,3],[33,2,33,3],[32,2,32,3],[31,2,31,3],[30,2,30,3],[29,2,29,3],[28,2,28,3],[27,2,27,3],[26,2,26,3],[25,2,25,3],[36,4,36,5]]}
[]
[null,null,"POBLACION ASIGNADA POR DISTRITO SIERRA, HOSPITAL, MICROREDES Y POR ETAPAS DE VIDA 2017"]
[]
[]
[]
[]
[null,null,"DISTRITO",null,null,null,null,null,null,null,null,null,null,null,null,"MICROREDES"]
[null,null,65,67,11,74,60,28,76,33,null,null,null,4,null,82,83,84,85,86]
[null,"POBLACION POR\nETAPAS DE VIDA","Andajes","Caujul","Checras","Naván","Oyón","Paccho","Pachangara","Santa Leonor","TOTAL","PORC. (%)",null,"HOSPITAL HUACHO",null,"HUAURA","HUALMAY","SAYAN","VEGUETA","CHURIN OYON","Total Microredes"]
[]
[81,"Infantil (Men.1año)",{"$f":"VLOOKUP(C$8,Poblacion!$C$8:$CP$93,$A11)","v":0},{"$f":"VLOOKUP(D$8,Poblacion!$C$8:$CP$93,$A11)","v":7},{"$f":"VLOOKUP(E$8,Poblacion!$C$8:$CP$93,$A11)","v":5},{"$f":"VLOOKUP(F$8,Poblacion!$C$8:$CP$93,$A11)","v":10},{"$f":"VLOOKUP(G$8,Poblacion!$C$8:$CP$93,$A11)","v":122},{"$f":"VLOOKUP(H$8,Poblacion!$C$8:$CP$93,$A11)","v":9},{"$f":"VLOOKUP(I$8,Poblacion!$C$8:$CP$93,$A11)","v":14},{"$f":"VLOOKUP(J$8,Poblacion!$C$8:$CP$93,$A11)","v":5},{"$f":"SUM(C11:J11)","v":172},{"$f":"IFERROR((K11/$K$20)*100,0)","v":1.0290774201268398},null,{"$f":"VLOOKUP(N$8,Poblacion!$C$8:$CP$93,$A11)","v":1437},null,{"$f":"VLOOKUP(P$8,Poblacion!$C$8:$CP$93,$A11)","v":597},{"$f":"VLOOKUP(Q$8,Poblacion!$C$8:$CP$93,$A11)","v":1315},{"$f":"VLOOKUP(R$8,Poblacion!$C$8:$CP$93,$A11)","v":435},{"$f":"VLOOKUP(S$8,Poblacion!$C$8:$CP$93,$A11)","v":408},{"$f":"VLOOKUP(T$8,Poblacion!$C$8:$CP$93,$A11)","v":223},{"$f":"SUM(P11:T11)","v":2978}]
[82,"Pre-escolar (01-04años)",{"$f":"VLOOKUP(C$8,Poblacion!$C$8:$CP$93,$A12)","v":6},{"$f":"VLOOKUP(D$8,Poblacion!$C$8:$CP$93,$A12)","v":42},{"$f":"VLOOKUP(E$8,Poblacion!$C$8:$CP$93,$A12)","v":11},{"$f":"VLOOKUP(F$8,Poblacion!$C$8:$CP$93,$A12)","v":65},{"$f":"VLOOKUP(G$8,Poblacion!$C$8:$CP$93,$A12)","v":554},{"$f":"VLOOKUP(H$8,Poblacion!$C$8:$CP$93,$A12)","v":93},{"$f":"VLOOKUP(I$8,Poblacion!$C$8:$CP$93,$A12)","v":133},{"$f":"VLOOKUP(J$8,Poblacion!$C$8:$CP$93,$A12)","v":65},969,5.7975350005983008,null,{"$f":"VLOOKUP(N$8,Poblacion!$C$8:$CP$93,$A12)","v":3698},null,{"$f":"VLOOKUP(P$8,Poblacion!$C$8:$CP$93,$A12)","v":2424},{"$f":"VLOOKUP(Q$8,Poblacion!$C$8:$CP$93,$A12)","v":5017},{"$f":"VLOOKUP(R$8,Poblacion!$C$8:$CP$93,$A12)","v":2097},{"$f":"VLOOKUP(S$8,Poblacion!$C$8:$CP$93,$A12)","v":1861},{"$f":"VLOOKUP(T$8,Poblacion!$C$8:$CP$93,$A12)","v":1244},12643]
[83,"Niño (0-11años)",{"$f":"VLOOKUP(C$8,Poblacion!$C$8:$CP$93,$A13)","v":55},{"$f":"VLOOKUP(D$8,Poblacion!$C$8:$CP$93,$A13)","v":120},{"$f":"VLOOKUP(E$8,Poblacion!$C$8:$CP$93,$A13)","v":145},{"$f":"VLOOKUP(F$8,Poblacion!$C$8:$CP$93,$A13)","v":193},{"$f":"VLOOKUP(G$8,Poblacion!$C$8:$CP$93,$A13)","v":2119},{"$f":"VLOOKUP(H$8,Poblacion!$C$8:$CP$93,$A13)","v":255},{"$f":"VLOOKUP(I$8,Poblacion!$C$8:$CP$93,$A13)","v":389},{"$f":"VLOOKUP(J$8,Poblacion!$C$8:$CP$93,$A13)","v":211},3487,20.862749790594712,null,{"$f":"VLOOKUP(N$8,Poblacion!$C$8:$CP$93,$A13)","v":10706},null,{"$f":"VLOOKUP(P$8,Poblacion!$C$8:$CP$93,$A13)","v":7608},{"$f":"VLOOKUP(Q$8,Poblacion!$C$8:$CP$93,$A13)","v":16370},{"$f":"VLOOKUP(R$8,Poblacion!$C$8:$CP$93,$A13)","v":6333},{"$f":"VLOOKUP(S$8,Poblacion!$C$8:$CP$93,$A13)","v":5418},{"$f":"VLOOKUP(T$8,Poblacion!$C$8:$CP$93,$A13)","v":4465},40194]
[84,"Escolar  (05-17años)",{"$f":"VLOOKUP(C$8,Poblacion!$C$8:$CP$93,$A14)","v":87},{"$f":"VLOOKUP(D$8,Poblacion!$C$8:$CP$93,$A14)","v":134},{"$f":"VLOOKUP(E$8,Poblacion!$C$8:$CP$93,$A14)","v":227},{"$f":"VLOOKUP(F$8,Poblacion!$C$8:$CP$93,$A14)","v":221},{"$f":"VLOOKUP(G$8,Poblacion!$C$8:$CP$93,$A14)","v":2460},{"$f":"VLOOKUP(H$8,Poblacion!$C$8:$CP$93,$A14)","v":305},{"$f":"VLOOKUP(I$8,Poblacion!$C$8:$CP$93,$A14)","v":435},{"$f":"VLOOKUP(J$8,Poblacion!$C$8:$CP$93,$A14)","v":252},4121,24.655977025248294,null,{"$f":"VLOOKUP(N$8,Poblacion!$C$8:$CP$93,$A14)","v":9743},null,{"$f":"VLOOKUP(P$8,Poblacion!$C$8:$CP$93,$A14)","v":8224},{"$f":"VLOOKUP(Q$8,Poblacion!$C$8:$CP$93,$A14)","v":17957},{"$f":"VLOOKUP(R$8,Poblacion!$C$8:$CP$93,$A14)","v":6923},{"$f":"VLOOKUP(S$8,Poblacion!$C$8:$CP$93,$A14)","v":5334},{"$f":"VLOOKUP(T$8,Poblacion!$C$8:$CP$93,$A14)","v":5251},43689]
[85,"Adolescente (12-17años)",{"$f":"VLOOKUP(C$8,Poblacion!$C$8:$CP$93,$A15)","v":38},{"$f":"VLOOKUP(D$8,Poblacion!$C$8:$CP$93,$A15)","v":63},{"$f":"VLOOKUP(E$8,Poblacion!$C$8:$CP$93,$A15)","v":98},{"$f":"VLOOKUP(F$8,Poblacion!$C$8:$CP$93,$A15)","v":103},{"$f":"VLOOKUP(G$8,Poblacion!$C$8:$CP$93,$A15)","v":1017},{"$f":"VLOOKUP(H$8,Poblacion!$C$8:$CP$93,$A15)","v":152},{"$f":"VLOOKUP(I$8,Poblacion!$C$8:$CP$93,$A15)","v":193},{"$f":"VLOOKUP(J$8,Poblacion!$C$8:$CP$93,$A15)","v":111},1775,10.619839655378724,null,{"$f":"VLOOKUP(N$8,Poblacion!$C$8:$CP$93,$A15)","v":4172},null,{"$f":"VLOOKUP(P$8,Poblacion!$C$8:$CP$93,$A15)","v":3637},{"$f":"VLOOKUP(Q$8,Poblacion!$C$8:$CP$93,$A15)","v":7919},{"$f":"VLOOKUP(R$8,Poblacion!$C$8:$CP$93,$A15)","v":3122},{"$f":"VLOOKUP(S$8,Poblacion!$C$8:$CP$93,$A15)","v":2185},{"$f":"VLOOKUP(T$8,Poblacion!$C$8:$CP$93,$A15)","v":2253},19116]
[86,"Adulto Joven (18-29años)",{"$f":"VLOOKUP(C$8,Poblacion!$C$8:$CP$93,$A16)","v":41},{"$f":"VLOOKUP(D$8,Poblacion!$C$8:$CP$93,$A16)","v":103},{"$f":"VLOOKUP(E$8,Poblacion!$C$8:$CP$93,$A16)","v":134},{"$f":"VLOOKUP(F$8,Poblacion!$C$8:$CP$93,$A16)","v":130},{"$f":"VLOOKUP(G$8,Poblacion!$C$8:$CP$93,$A16)","v":1797},{"$f":"VLOOKUP(H$8,Poblacion!$C$8:$CP$93,$A16)","v":212},{"$f":"VLOOKUP(I$8,Poblacion!$C$8:$CP$93,$A16)","v":364},{"$f":"VLOOKUP(J$8,Poblacion!$C$8:$CP$93,$A16)","v":251},3032,18.140481033863825,null,{"$f":"VLOOKUP(N$8,Poblacion!$C$8:$CP$93,$A16)","v":9483},null,{"$f":"VLOOKUP(P$8,Poblacion!$C$8:$CP$93,$A16)","v":8547},{"$f":"VLOOKUP(Q$8,Poblacion!$C$8:$CP$93,$A16)","v":18148},{"$f":"VLOOKUP(R$8,Poblacion!$C$8:$CP$93,$A16)","v":6356},{"$f":"VLOOKUP(S$8,Poblacion!$C$8:$CP$93,$A16)","v":5113},{"$f":"VLOOKUP(T$8,Poblacion!$C$8:$CP$93,$A16)","v":3894},42058]
[87,"Adulto    (30-59años)",{"$f":"VLOOKUP(C$8,Poblacion!$C$8:$CP$93,$A17)","v":223},{"$f":"VLOOKUP(D$8,Poblacion!$C$8:$CP$93,$A17)","v":219},{"$f":"VLOOKUP(E$8,Poblacion!$C$8:$CP$93,$A17)","v":317},{"$f":"VLOOKUP(F$8,Poblacion!$C$8:$CP$93,$A17)","v":436},{"$f":"VLOOKUP(G$8,Poblacion!$C$8:$CP$93,$A17)","v":2680},{"$f":"VLOOKUP(H$8,Poblacion!$C$8:$CP$93,$A17)","v":558},{"$f":"VLOOKUP(I$8,Poblacion!$C$8:$CP$93,$A17)","v":711},{"$f":"VLOOKUP(J$8,Poblacion!$C$8:$CP$93,$A17)","v":472},5616,33.600574368792628,null,{"$f":"VLOOKUP(N$8,Poblacion!$C$8:$CP$93,$A17)","v":19765},null,{"$f":"VLOOKUP(P$8,Poblacion!$C$8:$CP$93,$A17)","v":14371},{"$f":"VLOOKUP(Q$8,Poblacion!$C$8:$CP$93,$A17)","v":32550},{"$f":"VLOOKUP(R$8,Poblacion!$C$8:$CP$93,$A17)","v":10627},{"$f":"VLOOKUP(S$8,Poblacion!$C$8:$CP$93,$A17)","v":8251},{"$f":"VLOOKUP(T$8,Poblacion!$C$8:$CP$93,$A17)","v":7004},72803]
[88,"Adu.Mayor (60 a MAS)",{"$f":"VLOOKUP(C$8,Poblacion!$C$8:$CP$93,$A18)","v":247},{"$f":"VLOOKUP(D$8,Poblacion!$C$8:$CP$93,$A18)","v":128},{"$f":"VLOOKUP(E$8,Poblacion!$C$8:$CP$93,$A18)","v":324},{"$f":"VLOOKUP(F$8,Poblacion!$C$8:$CP$93,$A18)","v":198},{"$f":"VLOOKUP(G$8,Poblacion!$C$8:$CP$93,$A18)","v":832},{"$f":"VLOOKUP(H$8,Poblacion!$C$8:$CP$93,$A18)","v":444},{"$f":"VLOOKUP(I$8,Poblacion!$C$8:$CP$93,$A18)","v":353},{"$f":"VLOOKUP(J$8,Poblacion!$C$8:$CP$93,$A18)","v":278},2804,16.776355151370108,null,{"$f":"VLOOKUP(N$8,Poblacion!$C$8:$CP$93,$A18)","v":8047},null,{"$f":"VLOOKUP(P$8,Poblacion!$C$8:$CP$93,$A18)","v":4371},{"$f":"VLOOKUP(Q$8,Poblacion!$C$8:$CP$93,$A18)","v":11952},{"$f":"VLOOKUP(R$8,Poblacion!$C$8:$CP$93,$A18)","v":3485},{"$f":"VLOOKUP(S$8,Poblacion!$C$8:$CP$93,$A18)","v":2582},{"$f":"VLOOKUP(T$8,Poblacion!$C$8:$CP$93,$A18)","v":3297},25687]
[79,"Gestantes",{"$f":"VLOOKUP(C$8,Poblacion!$C$8:$CP$93,$A19)","v":14},{"$f":"VLOOKUP(D$8,Poblacion!$C$8:$CP$93,$A19)","v":27},{"$f":"VLOOKUP(E$8,Poblacion!$C$8:$CP$93,$A19)","v":47},{"$f":"VLOOKUP(F$8,Poblacion!$C$8:$CP$93,$A19)","v":58},{"$f":"VLOOKUP(G$8,Poblacion!$C$8:$CP$93,$A19)","v":342},{"$f":"VLOOKUP(H$8,Poblacion!$C$8:$CP$93,$A19)","v":47},{"$f":"VLOOKUP(I$8,Poblacion!$C$8:$CP$93,$A19)","v":86},{"$f":"VLOOKUP(J$8,Poblacion!$C$8:$CP$93,$A19)","v":36},657,3.9308364245542662,null,{"$f":"VLOOKUP(N$8,Poblacion!$C$8:$CP$93,$A19)","v":937},null,{"$f":"VLOOKUP(P$8,Poblacion!$C$8:$CP$93,$A19)","v":919},{"$f":"VLOOKUP(Q$8,Poblacion!$C$8:$CP$93,$A19)","v":1943},{"$f":"VLOOKUP(R$8,Poblacion!$C$8:$CP$93,$A19)","v":723},{"$f":"VLOOKUP(S$8,Poblacion!$C$8:$CP$93,$A19)","v":627},{"$f":"VLOOKUP(T$8,Poblacion!$C$8:$CP$93,$A19)","v":798},5010]
[null," TOTAL",{"$f":"C13+C15+C16+C17+C18","v":604},{"$f":"D13+D15+D16+D17+D18","v":633},1018,1060,8445,1621,2010,1323,{"$f":"K13+K15+K16+K17+K18","v":16714},{"$f":"IFERROR((K20/$K$20)*100,0)","v":100},null,{"$f":"N13+N15+N16+N17+N18","v":52173},null,{"$f":"P13+P15+P16+P17+P18","v":38534},86939,29923,23549,20913,199858]
{"$rows_left_out":19}
{"sheet":"Pobla_EESS","index":3,"n_rows":60,"n_cols":16,"rows_kept":60,"cut":false,"hidden":false,"merged":[[39,4,45,4],[39,11,41,11],[42,11,46,11],[46,4,49,4],[9,4,13,4],[9,11,11,11],[12,11,16,11],[16,3,16,5],[19,10,19,12],[32,3,32,5],[37,3,37,8],[37,10,37,15],[1,3,4,10],[7,3,7,8],[7,10,7,15],[15,3,15,4],[25,4,29,4],[25,11,30,11],[30,4,31,4],[23,3,23,8],[23,10,23,15],[31,10,31,12],[50,4,52,4],[51,11,54,11],[54,3,54,5],[55,11,57,11],[58,10,58,12]]}
[]
[null,null,null,"POBLACIÓN SEGÚN DISTRITOS Y EE.SS - 2012"]
[]
[]
[]
[]
[]
[null,null,null,"SIN MICRORED",null,null,null,null,null,null,"MICRORED HUALMAY"]
[null,null,null,"DISTRITO","POBLACIÓN","EE.SS","POBLACIÓN","MASCULINO","FEMENINO",null,"DISTRITO","POBLACIÓN","EE.SS","POBLACIÓN","MASCULINO","FEMENINO"]
[null,null,null,"HUACHO",{"$f":"G10","v":52173},"HOSPITAL HUACHO",{"$f":"VLOOKUP($F10,Poblacion!$E$8:$I$87,2,FALSE)","v":52173},{"$f":"VLOOKUP($F10,Poblacion!$E$8:$I$87,4,FALSE)","v":25663},{"$f":"VLOOKUP($F10,Poblacion!$E$8:$I$87,5,FALSE)","v":26510},null,"HUALMAY",{"$f":"SUM(N10:N12)","v":27960},"C.S. HUALMAY",{"$f":"VLOOKUP($M10,Poblacion!$E$8:$I$87,2,FALSE)","v":13980},{"$f":"VLOOKUP($M10,Poblacion!$E$8:$I$87,4,FALSE)","v":6949},{"$f":"VLOOKUP($M10,Poblacion!$E$8:$I$87,5,FALSE)","v":7031}]
[null,null,null,"HUACHO",null,"CLINICA SAN PEDRO",0,null,null,null,"HUALMAY",null,"P.S. DGO. MANDAMIENTO",{"$f":"VLOOKUP($M11,Poblacion!$E$8:$I$87,2,FALSE)","v":9786},{"$f":"VLOOKUP($M11,Poblacion!$E$8:$I$87,4,FALSE)","v":4864},{"$f":"VLOOKUP($M11,Poblacion!$E$8:$I$87,5,FALSE)","v":4922}]
[null,null,null,"HUACHO",null,"ESSALUD GUSTAVO LA NATA",0,null,null,null,"HUALMAY",null,"P.S. CAMPO ALEGRE",{"$f":"VLOOKUP($M12,Poblacion!$E$8:$I$87,2,FALSE)","v":4194},{"$f":"VLOOKUP($M12,Poblacion!$E$8:$I$87,4,FALSE)","v":2085},{"$f":"VLOOKUP($M12,Poblacion!$E$8:$I$87,5,FALSE)","v":2109}]
[null,null,null,"HUACHO",null,"CLINICA SAN BARTOLOME",0,null,null,null,"S.MARIA",{"$f":"SUM(N13:N17)","v":35208},"C.S. SANTA MARIA",{"$f":"VLOOKUP($M13,Poblacion!$E$8:$I$87,2,FALSE)","v":9858},{"$f":"VLOOKUP($M13,Poblacion!$E$8:$I$87,4,FALSE)","v":4971},{"$f":"VLOOKUP($M13,Poblacion!$E$8:$I$87,5,FALSE)","v":4887}]
[null,null,null,"HUACHO",null,"GOLD ESTANDAR EIRL.",0,null,null,null,"S.MARIA",null,"P.S. CHONTA",{"$f":"VLOOKUP($M14,Poblacion!$E$8:$I$87,2,FALSE)","v":5281},{"$f":"VLOOKUP($M14,Poblacion!$E$8:$I$87,4,FALSE)","v":2663},{"$f":"VLOOKUP($M14,Poblacion!$E$8:$I$87,5,FALSE)","v":2618}]
[null,null,null,"CARQUIN",null,"INSITUTO NACIONAL PENITENCIARIO CARQUIN",0,null,null,null,"S.MARIA",null,"P.S. ZAPATA",{"$f":"VLOOKUP($M15,Poblacion!$E$8:$I$87,2,FALSE)","v":2817},{"$f":"VLOOKUP($M15,Poblacion!$E$8:$I$87,4,FALSE)","v":1420},{"$f":"VLOOKUP($M15,Poblacion!$E$8:$I$87,5,FALSE)","v":1397}]
[null,null,null,null,null,"OTROS ESTABLECIMIENTOS",0,null,null,null,"S.MARIA",null,"P.S. AMADO VELASQUEZ",{"$f":"VLOOKUP($M16,Poblacion!$E$8:$I$87,2,FALSE)","v":9858},{"$f":"VLOOKUP($M16,Poblacion!$E$8:$I$87,4,FALSE)","v":4971},{"$f":"VLOOKUP($M16,Poblacion!$E$8:$I$87,5,FALSE)","v":4887}]
[null,null,null,"TOTAL SIN MICRORED",null,null,{"$f":"SUM(G10:G16)","v":52173},{"$f":"SUM(H10:H16)","v":25663},{"$f":"SUM(I10:I16)","v":26510},null,"S.MARIA",null,"P.S. SAN BARTOLOME",{"$f":"VLOOKUP($M17,Poblacion!$E$8:$I$87,2,FALSE)","v":7394},{"$f":"VLOOKUP($M17,Poblacion!$E$8:$I$87,4,FALSE)","v":3730},{"$f":"VLOOKUP($M17,Poblacion!$E$8:$I$87,5,FALSE)","v":3664}]
[null,null,null,{"$f":"'etapas y mredes'!B21","v":"Elaboración: Área de Estadística - RIS Huaura Oyón."},null,null,null,null,null,null,"CARQUIN",{"$f":"N18","v":6380},"P.S. CARQUIN",{"$f":"VLOOKUP($M18,Poblacion!$E$8:$I$87,2,FALSE)","v":6380},{"$f":"VLOOKUP($M18,Poblacion!$E$8:$I$87,4,FALSE)","v":3285},{"$f":"VLOOKUP($M18,Poblacion!$E$8:$I$87,5,FALSE)","v":3095}]
[null,null,null,null,null,null,null,null,null,null,"HUACHO",{"$f":"N19","v":17391},"C.S. MANZANARES",{"$f":"VLOOKUP($M19,Poblacion!$E$8:$I$87,2,FALSE)","v":17391},{"$f":"VLOOKUP($M19,Poblacion!$E$8:$I$87,4,FALSE)","v":8554},{"$f":"VLOOKUP($M19,Poblacion!$E$8:$I$87,5,FALSE)","v":8837}]
[null,null,null,null,null,null,null,null,null,null,"TOTAL MCR HUALMAY",null,"TOTAL MICRORED HUALMAY",{"$f":"SUM(N10:N19)","v":86939},{"$f":"SUM(O10:O19)","v":43492},{"$f":"SUM(P10:P19)","v":43447}]
{"$rows_left_out":40}