{"text_format":"1","workbook":"xlsx","n_sheets":3,"sheets":["Interfaz","Poblacion","Pobla_EESS"],"not_rendered":{"charts":0,"images":10,"macros":1,"external_links":1,"defined_names":4,"comments":0,"pivot_tables":0},"unopened":[],"bounds":{"document_bytes":16777216,"sheet_cells":100000,"rows_first":2000,"rows_last":500,"rows_between":2000,"halvings":0,"cell_chars":16384,"cell_head_chars":4096},"cells_cut":0,"cells_raw":0,"read":"whole","date_system":"1900"}

{"sheet":"Interfaz","index":0,"n_rows":27,"n_cols":18,"rows_kept":27,"cut":false,"hidden":false,"merged":[[4,2,7,11],[9,2,11,11]]}
[]
[]
[]
[]
[null,null,"POBLACIÓN ASIGNADA SEGÚN CENSOS INEI - RENIEC - PN - CNV - 2016"]
[]
[]
[]
[]
[null,null,"RED INTEGRADA DE SALUD HUAURA OYÓN "]
[]
[]
[]
[]
[]
[]
[]
[]
[]
[]
[]
["Elaboración: Área de Estadística - RIS Huaura Oyón."]
["NOTA: LA POBLACION ESTIMADA DE EDADES  SIMPLES Y GRUPOS DE EDAD DE DISTRITOS, CORRESPONDEN A CIFRAS REFERENCIALES HASTA OBTENER LAS CIFRAS DE LAS PROYECCIONES DEL INEI"]
[]
[]
["OFICINA DE GESTION DE LA INFORMACIÓN - MINISTERIO DE SALUD"]
[null,null,null,null,null,null,null,null,null,null,null,null,null,null,null,null,null,"Versión1.030"]

{"sheet":"Poblacion","index":1,"n_rows":93,"n_cols":104,"rows_kept":93,"cut":false,"hidden":false,"merged":[[5,40,5,41],[4,42,4,43],[4,44,4,45],[5,42,5,43],[5,44,5,45],[4,5,6,5],[5,12,5,13],[4,14,4,15],[5,14,5,15],[5,36,5,37],[4,28,4,29],[5,32,5,33],[5,34,5,35],[5,28,5,29],[5,30,5,31],[5,24,5,25],[5,26,5,27],[4,16,4,17],[5,16,5,17],[4,7,6,7],[4,8,6,8],[5,50,5,51],[4,10,4,11],[5,10,5,11],[4,12,4,13],[4,18,4,19],[4,20,4,21],[4,22,4,23],[4,24,4,25],[4,26,4,27],[5,18,5,19],[5,20,5,21],[5,22,5,23],[4,38,4,39],[5,38,5,39],[5,48,5,49],[5,46,5,47],[1,30,1,51],[2,30,2,51],[4,48,4,49],[3,30,3,51],[4,36,4,37],[4,30,4,31],[4,32,4,33],[4,34,4,35],[4,50,4,51],[4,40,4,41],[4,46,4,47],[4,52,6,52],[4,53,6,53],[4,54,6,54],[4,61,6,61],[4,60,6,60],[4,55,4,58],[5,55,6,55],[5,56,6,56],[5,57,6,57],[5,58,6,58],[4,62,6,62],[4,71,6,71],[2,65,2,72],[4,70,6,70],[4,69,6,69],[4,63,6,63],[4,64,6,64],[4,65,6,65],[4,67,6,67],[4,66,6,66]]}
[null,null,1,2,3,4,5,6,7,8,9,10,11,12,13,14,15,16,17,18,19,20,21,22,23,24,25,26,27,28,29,30,31,32,33,34,35,36,37,38,39,40,41,42,43,44,45,46,47,48,49,50,51,52,53,54,55,56,57,58,59,60,61,62,63,64,65,66,67,68,69,70,null,null,null,77,78,79,80,81,82,83,84,85,86,87,88,89,90,91,92,93,94,95,96,97,98,99,106,107,108,109,110,111]
[null,null,null,null,null,null,null,null,null,null,null,null,null,null,null,null,null,null,null,null,null,null,null,null,null,null,null,null,null,null,"POBLACIÓN ESTIMADA POR GRUPOS DE EDAD, SEGÚN PROVINCIAS DISTRITOS Y ESTABLECIMIENTOS DE SALUD"]
[null,null,null,null,null,null,null,null,null,null,null,null,null,null,null,null,null,null,null,null,null,null,null,null,null,null,null,null,null,null,"RED INTEGRADA DE SALUD HUAURA OYON   -   AÑO  2016",null,null,null,null,null,null,null,null,null,null,null,null,null,null,null,null,null,null,null,null,null,null,null,null,null,null,null,null,null,null,null,null,null,null,"MAS GRUPOS DE EDAD"]
[null,null,null,null,null,null,null,null,null,null,null,null,null,null,null,null,null,null,null,null,null,null,null,null,null,null,null,null,null,null,"EDADES PUNTUALES Y GRUPOS DE EDAD"]
[null,null,"N°",null,"DIRECCION DE SALUD","TOTAL GENERAL",null,"TOTAL MASCULINO","TOTAL FEMENINO",null,"EDAD",null,"EDAD",null,"EDAD",null,"EDAD",null,"EDAD",null,"EDAD",null,"EDAD",null,"EDAD",null,"EDAD",null,"EDAD",null,"EDAD",null,"EDAD",null,"EDAD",null,"EDAD",null,"EDAD",null,"EDAD",null,"EDAD",null,"EDAD",null,"EDAD",null,"EDAD",null,"EDAD",null,"NACIMIENTOS","28 DIAS","POBLACION FEMENINA TOTAL","POBLACION FEMENINA",null,null,null,null,"menor de 1 Año","Pre escolar         (1-4)","Niño             (0 - 11)","Escolar               (05 - 17)","Adolescente (12 - 17)","Adulto Joven (18 - 29)","Adulto            (30-59)","Adu.Mayor (60 a MAS)",null,"Escolar               (05 - 09)","Adolescente (10 - 19)","Adulto            (20-59)"]
["UBIGEO",null,null,null,"PROVINCIA",null,null,null,null,null,0,null,1,null,2,null,3,null,4,null,"5 - 9","5 - 9","10 - 14","10 - 14","15 - 19","20 - 24","20- 24","20 - 24","25 - 29",null,"30 - 34",null,"35 - 39",null,"40 - 44",null,"45 - 49",null,"50 - 54",null,"55 - 59",null,"60 - 64",null,"65-69",null,"70-74",null,"75-79",null,"80 - +",null,null,null,null,"10-14","15-19","20-49","GESTANTE"]
[null,"Microredes",null,"RENAES","DISTRITO",null,null,null,null,null,"M","F","M","F","M","F","M","F","M","F","M","F","M","F","M","F","M","F","M","F","M","F","M","F","M","F","M","F","M","F","M","F","M","F","M","F","M","F","M","F","M","F"]
[150000,null,1,null,"HUAURA - OYON",246685,null,122146,124539,null,2161,2203,2060,2100,1994,2033,1960,1999,1953,1992,10284,10485,11508,11734,10934,11148,10681,10890,9265,9447,8637,8807,8764,8935,7588,7737,6873,7008,6196,6318,5372,5477,4485,4572,3731,3804,3129,3191,2225,2268,2346,2391,4479,335,64764,11648,11139,53624,5657,null,{"$f":"SUM(K8:L8)","v":4364},{"$f":"SUM(M8:T8)","v":16091},{"$f":"SUM(K8:AH8)","v":161974},{"$f":"SUM(U8:AT8)","v":210680},{"$f":"SUM(AI8:AT8)","v":69161},{"$f":"SUM(AU8:AZ8)","v":15550},{"$f":"SUM(#REF!)","v":{"$error":"#REF!"}},{"$f":"SUM(#REF!)","v":{"$error":"#REF!"}},null,{"$f":"SUM(U8:AD8)","v":106376},{"$f":"SUM(AE8:AX8)","v":115117},{"$f":"SUM(AY8:AZ8)","v":4737}]
[150800,null,2,150800,"PROVINCIA HUAURA",222422,null,110132,112290,null,1905,1943,1814,1849,1754,1789,1724,1757,1717,1750,9067,9244,10262,10464,9981,10176,9764,9956,8346,8510,7772,7925,7830,7983,6896,7031,6226,6348,5669,5780,4926,5022,4129,4209,3369,3435,2837,2893,1992,2031,2152,2195,3949,296,58920,10334,10124,48796,4974,null,3848,14154,145282,190320,63040,14100,{"$f":"SUM(#REF!)","v":{"$error":"#REF!"}},{"$f":"SUM(#REF!)","v":{"$error":"#REF!"}},null,95770,104303,4347]
[150801,null,3,150802,"DISTRITO HUACHO",59431,null,29426,30005,null,462,472,434,443,415,424,405,413,401,409,2133,2175,2484,2532,2463,2511,2516,2565,2158,2201,2022,2062,2114,2155,1935,1973,1798,1834,1756,1791,1500,1529,1230,1254,1021,1041,863,879,630,643,686,699,958,72,15542,2496,2436,13106,1201,null,934,3344,36369,50753,18662,4400,{"$f":"SUM(#REF!)","v":{"$error":"#REF!"}},{"$f":"SUM(#REF!)","v":{"$error":"#REF!"}},null,23738,30030,1385]
[null,"00",4,7639,"HOSPITAL HUACHO",44573,null,22070,22503,null,347,353,326,332,311,318,304,309,301,306,1600,1632,1862,1899,1846,1883,1888,1924,1619,1651,1517,1547,1585,1617,1451,1480,1349,1375,1317,1343,1125,1147,922,941,766,780,647,659,473,482,514,525,718,54,11656,1872,1827,9829,901,null,700,2507,27277,38066,13996,3300,{"$f":"SUM(#REF!)","v":{"$error":"#REF!"}},{"$f":"SUM(#REF!)","v":{"$error":"#REF!"}},null,17804,22523,1039]
[null,"02",5,5679,"C.S. MANZANARES",14858,null,7355,7503,null,116,118,108,111,104,106,102,103,101,102,533,543,621,634,616,629,628,641,539,550,505,515,528,539,484,493,450,458,439,448,375,382,307,314,255,261,216,220,157,161,171,175,240,18,3886,624,609,3277,300,null,234,837,9092,12687,4666,1100,{"$f":"SUM(#REF!)","v":{"$error":"#REF!"}},{"$f":"SUM(#REF!)","v":{"$error":"#REF!"}},null,5934,7507,346]
[150802,null,6,150802,"DISTRITO AMBAR",2779,null,1377,1402,null,20,20,24,24,27,28,30,30,32,32,170,173,150,152,103,105,109,112,84,86,83,85,82,83,68,70,77,79,69,71,58,59,54,55,49,49,36,36,24,24,28,29,41,3,638,148,107,531,54,null,40,227,1844,2335,758,177,{"$f":"SUM(#REF!)","v":{"$error":"#REF!"}},{"$f":"SUM(#REF!)","v":{"$error":"#REF!"}},null,1244,1211,57]
[null,"01",7,5680,"C.S. AMBAR",1667,null,826,841,null,12,12,14,15,16,17,18,18,19,19,102,103,90,91,61,63,66,68,51,51,50,51,49,50,41,42,47,47,42,42,35,35,32,33,29,30,21,22,14,15,17,17,25,2,383,89,64,319,32,null,24,136,1106,1401,455,106,{"$f":"SUM(#REF!)","v":{"$error":"#REF!"}},{"$f":"SUM(#REF!)","v":{"$error":"#REF!"}},null,746,727,34]
[null,"01",8,5681,"P.S. AYNACA",1112,null,550,562,null,8,8,9,10,11,11,12,12,13,13,68,70,60,61,42,42,43,44,34,34,33,34,33,33,27,28,31,31,28,28,23,24,22,22,19,20,14,15,9,10,11,12,16,1,255,59,43,212,22,null,16,91,738,934,303,71,{"$f":"SUM(#REF!)","v":{"$error":"#REF!"}},{"$f":"SUM(#REF!)","v":{"$error":"#REF!"}},null,498,484,23]
[150803,null,9,150803,"DISTRITO CARQUIN",6905,null,3418,3487,null,62,63,59,61,58,59,56,58,55,56,270,276,276,282,281,287,329,335,304,310,290,296,251,256,242,246,183,186,177,181,144,147,113,116,104,107,72,73,43,43,49,49,128,10,1834,296,322,1512,164,null,125,462,4630,5989,1946,329,{"$f":"SUM(#REF!)","v":{"$error":"#REF!"}},{"$f":"SUM(#REF!)","v":{"$error":"#REF!"}},null,2950,3270,98]
[null,"02",10,5664,"P.S. CARQUIN",6905,null,3418,3487,null,62,63,59,61,58,59,56,58,55,56,270,276,276,282,281,287,329,335,304,310,290,296,251,256,242,246,183,186,177,181,144,147,113,116,104,107,72,73,43,43,49,49,128,10,1834,296,322,1512,164,null,125,462,4630,5989,1946,329,{"$f":"SUM(#REF!)","v":{"$error":"#REF!"}},{"$f":"SUM(#REF!)","v":{"$error":"#REF!"}},null,2950,3270,98]
[150804,null,11,150804,"DISTRITO CHECRAS",1808,null,894,914,null,14,15,13,13,12,12,12,12,12,12,67,68,81,82,52,54,35,36,44,45,40,41,61,62,56,57,52,54,70,71,52,54,54,56,45,45,59,61,33,34,30,30,30,2,343,76,43,300,40,null,29,98,895,1434,666,247,{"$f":"SUM(#REF!)","v":{"$error":"#REF!"}},{"$f":"SUM(#REF!)","v":{"$error":"#REF!"}},null,564,1057,60]
[null,"05",12,5663,"P.S. PUÑUN",1808,null,894,914,null,14,15,13,13,12,12,12,12,12,12,67,68,81,82,52,54,35,36,44,45,40,41,61,62,56,57,52,54,70,71,52,54,54,56,45,45,59,61,33,34,30,30,30,2,343,76,43,300,40,null,29,98,895,1434,666,247,{"$f":"SUM(#REF!)","v":{"$error":"#REF!"}},{"$f":"SUM(#REF!)","v":{"$error":"#REF!"}},null,564,1057,60]
[150805,null,13,150805,"DISTRITO HUALMAY",29028,null,14374,14654,null,249,254,234,238,224,228,218,223,217,221,1162,1185,1348,1374,1274,1299,1272,1296,1089,1110,1021,1040,1049,1070,946,964,780,796,736,751,669,683,539,550,459,467,338,345,260,265,290,295,516,39,7689,1337,1297,6392,647,null,503,1803,18895,24929,8340,1793,{"$f":"SUM(#REF!)","v":{"$error":"#REF!"}},{"$f":"SUM(#REF!)","v":{"$error":"#REF!"}},null,12409,13728,585]
[null,"02",14,5665,"C.S. HUALMAY",14514,null,7185,7329,null,125,127,117,119,112,114,109,112,108,111,582,593,674,688,637,650,635,648,544,554,510,520,524,535,472,482,390,398,368,376,335,341,270,275,229,234,169,173,130,132,145,147,258,19,3845,668,648,3196,324,null,252,902,9448,12464,4170,896,{"$f":"SUM(#REF!)","v":{"$error":"#REF!"}},{"$f":"SUM(#REF!)","v":{"$error":"#REF!"}},null,6205,6863,292]
[null,"02",15,5666,"P.S. DGO. MANDAMIENTO",10160,null,5029,5131,null,87,89,82,83,78,80,76,78,76,77,407,414,471,481,446,454,446,454,381,389,357,365,367,375,331,338,273,279,257,263,234,239,189,192,160,164,118,121,91,93,102,103,181,14,2691,468,454,2237,226,null,176,630,6613,8726,2919,628,{"$f":"SUM(#REF!)","v":{"$error":"#REF!"}},{"$f":"SUM(#REF!)","v":{"$error":"#REF!"}},null,4343,4806,205]
[null,"02",16,5667,"P.S. CAMPO ALEGRE",4354,null,2158,2196,null,37,38,35,36,34,34,33,33,33,33,174,177,202,206,191,195,191,194,164,167,153,156,157,161,142,145,117,119,110,113,101,102,81,82,69,70,51,51,39,40,44,44,77,6,1153,201,195,959,97,null,75,271,2834,3739,1251,269,{"$f":"SUM(#REF!)","v":{"$error":"#REF!"}},{"$f":"SUM(#REF!)","v":{"$error":"#REF!"}},null,1861,2059,88]
[150806,null,17,150806,"DISTRITO HUAURA                   ",35916,null,17785,18131,null,316,323,300,305,289,295,284,290,285,290,1531,1560,1815,1850,1877,1913,1671,1703,1399,1427,1285,1310,1243,1267,1094,1116,977,996,835,852,679,693,549,559,455,464,404,411,249,254,248,253,656,49,10022,1797,1876,8146,823,null,639,2338,24828,31120,9269,1819,{"$f":"SUM(#REF!)","v":{"$error":"#REF!"}},{"$f":"SUM(#REF!)","v":{"$error":"#REF!"}},null,16746,15692,501]
[null,"01",18,5682,"C.S. HUAURA",16162,null,8004,8158,null,143,145,135,137,130,133,128,131,128,130,688,701,817,832,843,860,753,767,630,642,578,590,560,570,492,502,440,448,376,383,306,312,247,252,205,209,181,185,112,115,112,114,295,22,4511,808,843,3666,371,null,288,1052,11171,14003,4172,819,{"$f":"SUM(#REF!)","v":{"$error":"#REF!"}},{"$f":"SUM(#REF!)","v":{"$error":"#REF!"}},null,7533,7063,226]
[null,"01",19,5686,"C.S. SOCORRO",13648,null,6757,6891,null,120,123,114,116,110,112,108,110,108,110,582,593,689,703,714,727,635,647,532,542,488,498,472,482,416,424,371,379,317,324,258,263,208,213,173,176,153,157,95,96,94,96,249,19,3808,683,713,3095,313,null,243,888,9435,11826,3522,691,{"$f":"SUM(#REF!)","v":{"$error":"#REF!"}},{"$f":"SUM(#REF!)","v":{"$error":"#REF!"}},null,6364,5963,190]
[null,"01",20,5683,"P.S. HUMAYA",3592,null,1780,1812,null,32,32,30,31,29,29,28,29,29,29,153,157,182,185,188,192,166,170,140,143,128,131,124,126,109,112,98,99,84,85,68,69,55,56,46,46,41,41,25,25,25,25,66,5,1002,180,188,815,82,null,64,234,2483,3112,927,182,{"$f":"SUM(#REF!)","v":{"$error":"#REF!"}},{"$f":"SUM(#REF!)","v":{"$error":"#REF!"}},null,1676,1568,50]
[null,"01",21,5684,"P.S. VILCAHUAURA",2155,null,1066,1089,null,19,19,18,18,17,18,17,17,17,18,92,94,109,111,112,115,100,102,84,86,77,79,75,76,66,68,58,60,50,51,41,41,33,33,27,28,24,25,15,15,15,15,39,3,601,108,113,489,49,null,38,140,1490,1868,556,109,{"$f":"SUM(#REF!)","v":{"$error":"#REF!"}},{"$f":"SUM(#REF!)","v":{"$error":"#REF!"}},null,1005,942,30]
[null,"01",22,5685,"P.S. PEÑICO",359,null,174,185,null,3,3,3,3,3,3,3,3,3,3,15,16,18,19,19,20,17,17,13,14,13,13,12,13,10,11,10,10,8,9,7,7,5,6,4,5,4,4,2,3,2,3,7,0,100,18,19,81,8,null,6,24,249,311,92,18,{"$f":"SUM(#REF!)","v":{"$error":"#REF!"}},{"$f":"SUM(#REF!)","v":{"$error":"#REF!"}},null,168,156,5]
[150807,null,23,150807,"DISTRITO LEONCIO PRADO",2010,null,995,1015,null,15,15,18,19,21,21,22,23,23,23,109,112,79,80,74,75,84,86,74,76,60,62,62,64,53,55,59,60,58,59,38,38,38,38,32,32,30,30,21,22,25,25,31,2,469,90,70,399,42,null,30,170,1297,1657,560,153,{"$f":"SUM(#REF!)","v":{"$error":"#REF!"}},{"$f":"SUM(#REF!)","v":{"$error":"#REF!"}},null,849,911,50]
[null,"03",24,5778,"P.S. AUQUIMARCA",101,null,47,54,null,1,1,1,1,1,1,1,1,1,1,5,5,4,5,3,4,4,5,4,4,3,3,3,3,2,3,3,3,3,3,2,2,2,2,1,2,1,2,1,1,1,2,2,0,23,5,4,20,2,null,2,8,65,83,28,8,{"$f":"SUM(#REF!)","v":{"$error":"#REF!"}},{"$f":"SUM(#REF!)","v":{"$error":"#REF!"}},null,43,45,3]
[null,"03",25,5779,"P.S. PARAN",1005,null,498,507,null,7,7,9,9,10,11,11,12,11,12,55,57,38,39,37,38,43,43,37,38,31,31,31,32,27,27,30,30,29,29,19,19,19,19,16,16,15,15,11,11,12,12,15,2,235,44,35,199,21,null,14,85,649,830,280,76,{"$f":"SUM(#REF!)","v":{"$error":"#REF!"}},{"$f":"SUM(#REF!)","v":{"$error":"#REF!"}},null,425,457,24]
[null,"03",26,6725,"P.S. SANTA CRUZ",442,null,215,227,null,3,4,4,4,4,5,5,5,5,5,24,24,17,18,16,16,18,19,16,17,13,14,14,15,12,12,13,13,13,13,8,9,8,9,7,7,6,7,4,5,5,6,7,0,103,20,15,88,9,null,7,37,285,365,124,33,{"$f":"SUM(#REF!)","v":{"$error":"#REF!"}},{"$f":"SUM(#REF!)","v":{"$error":"#REF!"}},null,185,202,11]
[null,"03",27,7757,"P.S. HUANANGUI",462,null,225,237,null,3,4,4,5,5,5,5,5,5,6,25,26,19,19,17,18,19,19,17,17,13,14,14,14,12,13,13,14,13,14,8,9,8,9,7,8,7,7,5,5,6,6,7,0,108,21,16,92,10,null,7,40,298,379,128,36,{"$f":"SUM(#REF!)","v":{"$error":"#REF!"}},{"$f":"SUM(#REF!)","v":{"$error":"#REF!"}},null,196,207,12]
[150808,null,28,150808,"DISTRITO PACCHO",2223,null,1099,1124,null,15,15,15,15,15,16,16,16,16,16,90,91,92,94,59,61,64,65,59,61,65,66,71,72,71,73,61,63,61,62,60,61,73,75,67,69,56,58,38,39,35,36,31,2,432,100,46,386,42,null,30,125,1165,1806,796,262,{"$f":"SUM(#REF!)","v":{"$error":"#REF!"}},{"$f":"SUM(#REF!)","v":{"$error":"#REF!"}},null,736,1261,71]
[null,"05",29,5650,"P.S. PACCHO",778,null,384,394,null,5,5,5,5,5,6,5,6,5,6,31,32,32,32,21,21,23,23,21,22,23,23,25,25,25,25,21,22,21,22,21,22,26,26,24,24,20,20,13,14,12,13,11,1,151,35,16,135,15,null,10,43,407,633,279,92,{"$f":"SUM(#REF!)","v":{"$error":"#REF!"}},{"$f":"SUM(#REF!)","v":{"$error":"#REF!"}},null,258,442,25]
[null,"05",30,5651,"P.S. LACSANGA",667,null,326,341,null,4,5,4,5,4,5,5,5,5,5,27,28,28,29,18,19,19,19,17,18,19,20,21,22,21,22,18,19,18,19,18,18,22,22,20,21,17,17,11,12,10,11,9,1,130,30,14,116,13,null,9,38,351,542,238,78,{"$f":"SUM(#REF!)","v":{"$error":"#REF!"}},{"$f":"SUM(#REF!)","v":{"$error":"#REF!"}},null,222,377,21]
[null,"05",31,5653,"P.S. AYARANGA",333,null,161,172,null,2,3,2,3,2,3,2,3,2,3,13,14,14,14,8,9,9,9,9,9,10,10,10,11,11,11,9,10,9,9,9,9,11,11,10,10,8,9,6,6,5,6,5,0,65,15,7,58,6,null,5,20,174,268,119,40,{"$f":"SUM(#REF!)","v":{"$error":"#REF!"}},{"$f":"SUM(#REF!)","v":{"$error":"#REF!"}},null,108,189,11]
[null,"05",32,5652,"P.S. MUZGA",445,null,218,227,null,3,3,3,3,3,3,3,3,3,3,18,18,18,19,12,12,13,14,12,12,13,13,14,15,14,15,12,13,12,13,12,12,15,15,13,14,11,12,7,8,7,7,6,0,86,20,9,77,8,null,6,24,233,363,160,52,{"$f":"SUM(#REF!)","v":{"$error":"#REF!"}},{"$f":"SUM(#REF!)","v":{"$error":"#REF!"}},null,148,253,14]
[150809,null,33,150809,"DISTRITO SANTA LEONOR",1477,null,732,745,null,11,11,10,11,10,10,10,10,11,11,67,68,84,86,52,54,46,46,34,34,35,36,45,46,44,45,45,46,51,52,36,37,41,41,29,30,29,29,23,23,19,19,23,2,323,78,59,264,32,null,{"$f":"SUM(K40:L40)","v":22},{"$f":"SUM(M40:T40)","v":83},{"$f":"SUM(K40:AH40)","v":838},{"$f":"SUM(U40:AT40)","v":1230},{"$f":"SUM(AI40:AT40)","v":497},{"$f":"SUM(AU40:AZ40)","v":142},{"$f":"SUM(#REF!)","v":{"$error":"#REF!"}},{"$f":"SUM(#REF!)","v":{"$error":"#REF!"}},null,{"$f":"SUM(U40:AD40)","v":571},{"$f":"SUM(AE40:AX40)","v":763},{"$f":"SUM(AY40:AZ40)","v":38}]
{"$rows_left_out":54}
{"sheet":"Pobla_EESS","index":2,"n_rows":60,"n_cols":16,"rows_kept":60,"cut":false,"hidden":false,"merged":[[50,4,52,4],[51,11,54,11],[54,3,54,5],[55,11,57,11],[58,10,58,12],[1,3,4,10],[7,3,7,8],[7,10,7,15],[15,3,15,4],[25,4,29,4],[25,11,30,11],[30,4,31,4],[23,3,23,8],[23,10,23,15],[31,10,31,12],[39,4,45,4],[39,11,41,11],[42,11,46,11],[46,4,49,4],[9,4,13,4],[9,11,11,11],[12,11,16,11],[16,3,16,5],[19,10,19,12],[32,3,32,5],[37,3,37,8],[37,10,37,15]]}
[]
[null,null,null,"POBLACIÓN SEGÚN DISTRITOS Y EE.SS - 2016"]
[]
[]
[]
[]
[]
[null,null,null,"SIN MICRORED",null,null,null,null,null,null,"MICRORED HUALMAY"]
[null,null,null,"DISTRITO","POBLACIÓN","EE.SS","POBLACIÓN","MASCULINO","FEMENINO",null,"DISTRITO","POBLACIÓN","EE.SS","POBLACIÓN","MASCULINO","FEMENINO"]
[null,null,null,"HUACHO",{"$f":"G10","v":44573},"HOSPITAL HUACHO",{"$f":"VLOOKUP($F10,Poblacion!$E$8:$I$87,2,FALSE)","v":44573},{"$f":"VLOOKUP($F10,Poblacion!$E$8:$I$87,4,FALSE)","v":22070},{"$f":"VLOOKUP($F10,Poblacion!$E$8:$I$87,5,FALSE)","v":22503},null,"HUALMAY",{"$f":"SUM(N10:N12)","v":29028},"C.S. HUALMAY",{"$f":"VLOOKUP($M10,Poblacion!$E$8:$I$87,2,FALSE)","v":14514},{"$f":"VLOOKUP($M10,Poblacion!$E$8:$I$87,4,FALSE)","v":7185},{"$f":"VLOOKUP($M10,Poblacion!$E$8:$I$87,5,FALSE)","v":7329}]
[null,null,null,"HUACHO",null,"CLINICA SAN PEDRO",0,null,null,null,"HUALMAY",null,"P.S. DGO. MANDAMIENTO",{"$f":"VLOOKUP($M11,Poblacion!$E$8:$I$87,2,FALSE)","v":10160},{"$f":"VLOOKUP($M11,Poblacion!$E$8:$I$87,4,FALSE)","v":5029},{"$f":"VLOOKUP($M11,Poblacion!$E$8:$I$87,5,FALSE)","v":5131}]
[null,null,null,"HUACHO",null,"ESSALUD GUSTAVO LA NATA",0,null,null,null,"HUALMAY",null,"P.S. CAMPO ALEGRE",{"$f":"VLOOKUP($M12,Poblacion!$E$8:$I$87,2,FALSE)","v":4354},{"$f":"VLOOKUP($M12,Poblacion!$E$8:$I$87,4,FALSE)","v":2158},{"$f":"VLOOKUP($M12,Poblacion!$E$8:$I$87,5,FALSE)","v":2196}]
[null,null,null,"HUACHO",null,"CLINICA SAN BARTOLOME",0,null,null,null,"S.MARIA",{"$f":"SUM(N13:N17)","v":34011},"C.S. SANTA MARIA",{"$f":"VLOOKUP($M13,Poblacion!$E$8:$I$87,2,FALSE)","v":9523},{"$f":"VLOOKUP($M13,Poblacion!$E$8:$I$87,4,FALSE)","v":4716},{"$f":"VLOOKUP($M13,Poblacion!$E$8:$I$87,5,FALSE)","v":4807}]
[null,null,null,"HUACHO",null,"GOLD ESTANDAR EIRL.",0,null,null,null,"S.MARIA",null,"P.S. CHONTA",{"$f":"VLOOKUP($M14,Poblacion!$E$8:$I$87,2,FALSE)","v":5102},{"$f":"VLOOKUP($M14,Poblacion!$E$8:$I$87,4,FALSE)","v":2527},{"$f":"VLOOKUP($M14,Poblacion!$E$8:$I$87,5,FALSE)","v":2575}]
[null,null,null,"CARQUIN",null,"INSITUTO NACIONAL PENITENCIARIO CARQUIN",0,null,null,null,"S.MARIA",null,"P.S. ZAPATA",{"$f":"VLOOKUP($M15,Poblacion!$E$8:$I$87,2,FALSE)","v":2721},{"$f":"VLOOKUP($M15,Poblacion!$E$8:$I$87,4,FALSE)","v":1346},{"$f":"VLOOKUP($M15,Poblacion!$E$8:$I$87,5,FALSE)","v":1375}]
[null,null,null,null,null,"OTROS ESTABLECIMIENTOS",0,null,null,null,"S.MARIA",null,"P.S. AMADO VELASQUEZ",{"$f":"VLOOKUP($M16,Poblacion!$E$8:$I$87,2,FALSE)","v":9183},{"$f":"VLOOKUP($M16,Poblacion!$E$8:$I$87,4,FALSE)","v":4546},{"$f":"VLOOKUP($M16,Poblacion!$E$8:$I$87,5,FALSE)","v":4637}]
[null,null,null,"TOTAL SIN MICRORED",null,null,{"$f":"SUM(G10:G16)","v":44573},{"$f":"SUM(H10:H16)","v":22070},{"$f":"SUM(I10:I16)","v":22503},null,"S.MARIA",null,"P.S. SAN BARTOLOME",{"$f":"VLOOKUP($M17,Poblacion!$E$8:$I$87,2,FALSE)","v":7482},{"$f":"VLOOKUP($M17,Poblacion!$E$8:$I$87,4,FALSE)","v":3704},{"$f":"VLOOKUP($M17,Poblacion!$E$8:$I$87,5,FALSE)","v":3778}]
[null,null,null,"Elaboración: Área de Estadística - RIS Huaura Oyón.",null,null,null,null,null,null,"CARQUIN",{"$f":"N18","v":6905},"P.S. CARQUIN",{"$f":"VLOOKUP($M18,Poblacion!$E$8:$I$87,2,FALSE)","v":6905},{"$f":"VLOOKUP($M18,Poblacion!$E$8:$I$87,4,FALSE)","v":3418},{"$f":"VLOOKUP($M18,Poblacion!$E$8:$I$87,5,FALSE)","v":3487}]
[null,null,null,null,null,null,null,null,null,null,"HUACHO",{"$f":"N19","v":14858},"C.S. MANZANARES",{"$f":"VLOOKUP($M19,Poblacion!$E$8:$I$87,2,FALSE)","v":14858},{"$f":"VLOOKUP($M19,Poblacion!$E$8:$I$87,4,FALSE)","v":7355},{"$f":"VLOOKUP($M19,Poblacion!$E$8:$I$87,5,FALSE)","v":7503}]
[null,null,null,null,null,null,null,null,null,null,"TOTAL MCR HUALMAY",null,"TOTAL MICRORED HUALMAY",{"$f":"SUM(N10:N19)","v":84802},{"$f":"SUM(O10:O19)","v":41984},{"$f":"SUM(P10:P19)","v":42818}]
[null,null,null,null,null,null,null,null,null,null,{"$f":"D18","v":"Elaboración: Área de Estadística - RIS Huaura Oyón."}]
[]
[]
[null,null,null,"MICRORED HUAURA",null,null,null,null,null,null,"MICRORED VEGUETA"]
[null,null,null,"DISTRITO","POBLACIÓN","EE.SS","POBLACIÓN","MASCULINO","FEMENINO",null,"DISTRITO","POBLACIÓN","EE.SS","POBLACIÓN","MASCULINO","FEMENINO"]
[null,null,null,"HUAURA",{"$f":"SUM(G26:G30)","v":35916},"C.S. HUAURA",{"$f":"VLOOKUP($F26,Poblacion!$E$8:$I$87,2,FALSE)","v":16162},{"$f":"VLOOKUP($F26,Poblacion!$E$8:$I$87,4,FALSE)","v":8004},{"$f":"VLOOKUP($F26,Poblacion!$E$8:$I$87,5,FALSE)","v":8158},null,"VEGUETA",{"$f":"SUM(N26:N31)","v":22369},"C.S. VEGUETA",{"$f":"VLOOKUP($M26,Poblacion!$E$8:$I$87,2,FALSE)","v":6710},{"$f":"VLOOKUP($M26,Poblacion!$E$8:$I$87,4,FALSE)","v":3321},{"$f":"VLOOKUP($M26,Poblacion!$E$8:$I$87,5,FALSE)","v":3389}]
[null,null,null,"HUAURA",null,"C.S. SOCORRO",{"$f":"VLOOKUP($F27,Poblacion!$E$8:$I$87,2,FALSE)","v":13648},{"$f":"VLOOKUP($F27,Poblacion!$E$8:$I$87,4,FALSE)","v":6757},{"$f":"VLOOKUP($F27,Poblacion!$E$8:$I$87,5,FALSE)","v":6891},null,"VEGUETA",null,"P.S. MAZO",{"$f":"VLOOKUP($M27,Poblacion!$E$8:$I$87,2,FALSE)","v":2237},{"$f":"VLOOKUP($M27,Poblacion!$E$8:$I$87,4,FALSE)","v":1105},{"$f":"VLOOKUP($M27,Poblacion!$E$8:$I$87,5,FALSE)","v":1132}]
[null,null,null,"HUAURA",null,"P.S. HUMAYA",{"$f":"VLOOKUP($F28,Poblacion!$E$8:$I$87,2,FALSE)","v":3592},{"$f":"VLOOKUP($F28,Poblacion!$E$8:$I$87,4,FALSE)","v":1780},{"$f":"VLOOKUP($F28,Poblacion!$E$8:$I$87,5,FALSE)","v":1812},null,"VEGUETA",null,"P.S. PRIMAVERA",{"$f":"VLOOKUP($M28,Poblacion!$E$8:$I$87,2,FALSE)","v":3132},{"$f":"VLOOKUP($M28,Poblacion!$E$8:$I$87,4,FALSE)","v":1550},{"$f":"VLOOKUP($M28,Poblacion!$E$8:$I$87,5,FALSE)","v":1582}]
[null,null,null,"HUAURA",null,"P.S. VILCAHUAURA",{"$f":"VLOOKUP($F29,Poblacion!$E$8:$I$87,2,FALSE)","v":2155},{"$f":"VLOOKUP($F29,Poblacion!$E$8:$I$87,4,FALSE)","v":1066},{"$f":"VLOOKUP($F29,Poblacion!$E$8:$I$87,5,FALSE)","v":1089},null,"VEGUETA",null,"P.S. MARIATEGUI",{"$f":"VLOOKUP($M29,Poblacion!$E$8:$I$87,2,FALSE)","v":5369},{"$f":"VLOOKUP($M29,Poblacion!$E$8:$I$87,4,FALSE)","v":2659},{"$f":"VLOOKUP($M29,Poblacion!$E$8:$I$87,5,FALSE)","v":2710}]
[null,null,null,"HUAURA",null,"P.S. PEÑICO",{"$f":"VLOOKUP($F30,Poblacion!$E$8:$I$87,2,FALSE)","v":359},{"$f":"VLOOKUP($F30,Poblacion!$E$8:$I$87,4,FALSE)","v":174},{"$f":"VLOOKUP($F30,Poblacion!$E$8:$I$87,5,FALSE)","v":185},null,"VEGUETA",null,"P.S. MEDIO MUNDO",{"$f":"VLOOKUP($M30,Poblacion!$E$8:$I$87,2,FALSE)","v":4026},{"$f":"VLOOKUP($M30,Poblacion!$E$8:$I$87,4,FALSE)","v":1996},{"$f":"VLOOKUP($M30,Poblacion!$E$8:$I$87,5,FALSE)","v":2030}]
[null,null,null,"AMBAR",{"$f":"SUM(G31:G32)","v":2779},"C.S. AMBAR",{"$f":"VLOOKUP($F31,Poblacion!$E$8:$I$87,2,FALSE)","v":1667},{"$f":"VLOOKUP($F31,Poblacion!$E$8:$I$87,4,FALSE)","v":826},{"$f":"VLOOKUP($F31,Poblacion!$E$8:$I$87,5,FALSE)","v":841},null,"VEGUETA",null,"P.S. TIROLER",{"$f":"VLOOKUP($M31,Poblacion!$E$8:$I$87,2,FALSE)","v":895},{"$f":"VLOOKUP($M31,Poblacion!$E$8:$I$87,4,FALSE)","v":441},{"$f":"VLOOKUP($M31,Poblacion!$E$8:$I$87,5,FALSE)","v":454}]
[null,null,null,"AMBAR",null,"P.S. AYNACA",{"$f":"VLOOKUP($F32,Poblacion!$E$8:$I$87,2,FALSE)","v":1112},{"$f":"VLOOKUP($F32,Poblacion!$E$8:$I$87,4,FALSE)","v":550},{"$f":"VLOOKUP($F32,Poblacion!$E$8:$I$87,5,FALSE)","v":562},null,"TOTAL MCR VEGUETA",null,null,{"$f":"SUM(N26:N31)","v":22369},{"$f":"SUM(O26:O31)","v":11072},{"$f":"SUM(P26:P31)","v":11297}]
[null,null,null,"TOTAL MCR HUAURA",null,"TOTAL MICRORED HUAURA ",{"$f":"SUM(G26:G32)","v":38695},{"$f":"SUM(H26:H32)","v":19157},19538,null,{"$f":"K21","v":"Elaboración: Área de Estadística - RIS Huaura Oyón."}]
[null,null,null,{"$f":"K21","v":"Elaboración: Área de Estadística - RIS Huaura Oyón."}]
[]
[]
[]
[null,null,null,"MICRORED SAYAN",null,null,null,null,null,null,"MICRORED CHURIN OYÓN"]
[null,null,null,"DISTRITO","POBLACIÓN","EE.SS","POBLACIÓN","MASCULINO","FEMENINO",null,"DISTRITO","POBLACIÓN","EE.SS","POBLACIÓN","MASCULINO","FEMENINO"]
[null,null,null,"SAYAN",{"$f":"SUM(G40:G46)","v":24465},"C.S. SAYAN",{"$f":"VLOOKUP($F40,Poblacion!$E$8:$I$87,2,FALSE)","v":10031},{"$f":"VLOOKUP($F40,Poblacion!$E$8:$I$87,4,FALSE)","v":4967},{"$f":"VLOOKUP($F40,Poblacion!$E$8:$I$87,5,FALSE)","v":5064},null,"PACHANGARA",{"$f":"SUM(M40:M42)","v":0},"C.S. CHURIN",{"$f":"VLOOKUP(M40,Poblacion!$E$5:$I$88,2,FALSE)","v":2155},{"$f":"VLOOKUP(M40,Poblacion!$E$5:$I$88,4,FALSE)","v":1069},{"$f":"VLOOKUP(M40,Poblacion!$E$5:$I$88,5,FALSE)","v":1086}]
{"$rows_left_out":20}