{"text_format":"1","workbook":"xlsx","n_sheets":3,"sheets":["Interfaz","Poblacion","Pobla_EESS"],"not_rendered":{"charts":0,"images":10,"macros":1,"external_links":1,"defined_names":4,"comments":0,"pivot_tables":0},"unopened":[],"bounds":{"document_bytes":16777216,"sheet_cells":100000,"rows_first":2000,"rows_last":500,"rows_between":2000,"halvings":0,"cell_chars":16384,"cell_head_chars":4096},"cells_cut":0,"cells_raw":0,"read":"whole","date_system":"1900"}

{"sheet":"Interfaz","index":0,"n_rows":27,"n_cols":18,"rows_kept":27,"cut":false,"hidden":false,"merged":[[4,2,7,11],[9,2,11,11]]}
[]
[]
[]
[]
[null,null,"POBLACIÓN ASIGNADA SEGÚN CENSOS INEI - RENIEC - PN - CNV - 2015"]
[]
[]
[]
[]
[null,null,"RED INTEGRADA DE SALUD HUAURA OYÓN "]
[]
[]
[]
[]
[]
[]
[]
[]
[]
[]
[]
["Elaboración: Área de Estadística - RIS Huaura Oyón."]
["NOTA: LA POBLACION ESTIMADA DE EDADES  SIMPLES Y GRUPOS DE EDAD DE DISTRITOS, CORRESPONDEN A CIFRAS REFERENCIALES HASTA OBTENER LAS CIFRAS DE LAS PROYECCIONES DEL INEI"]
[]
[]
["OFICINA DE GESTION DE LA INFORMACIÓN - MINISTERIO DE SALUD"]
[null,null,null,null,null,null,null,null,null,null,null,null,null,null,null,null,null,"Versión1.030"]

{"sheet":"Poblacion","index":1,"n_rows":93,"n_cols":91,"rows_kept":93,"cut":false,"hidden":false,"merged":[[5,40,5,41],[5,24,5,25],[5,32,5,33],[5,42,5,43],[5,38,5,39],[4,5,6,5],[4,42,4,43],[5,34,5,35],[5,30,5,31],[4,36,4,37],[5,36,5,37],[4,38,4,39],[5,22,5,23],[4,10,4,11],[4,12,4,13],[4,14,4,15],[4,16,4,17],[4,18,4,19],[5,10,5,11],[5,12,5,13],[5,14,5,15],[4,7,6,7],[4,8,6,8],[5,26,5,27],[4,28,4,29],[5,28,5,29],[5,16,5,17],[5,18,5,19],[4,20,4,21],[5,20,5,21],[1,20,1,41],[2,20,2,41],[4,34,4,35],[4,24,4,25],[3,20,3,41],[4,32,4,33],[4,26,4,27],[4,30,4,31],[4,40,4,41],[4,22,4,23],[5,48,5,49],[4,48,4,49],[4,46,4,47],[4,44,4,45],[4,55,4,58],[5,56,6,56],[5,57,6,57],[5,55,6,55],[5,58,6,58],[4,52,6,52],[4,53,6,53],[4,54,6,54],[4,50,4,51],[5,50,5,51],[5,44,5,45],[5,46,5,47]]}
[null,null,1,2,3,4,5,6,7,8,9,10,11,12,13,14,15,16,17,18,19,20,21,22,23,24,25,26,27,28,29,30,31,32,33,34,35,36,37,38,39,40,41,42,43,44,45,46,47,48,49,50,51,52,53,54,55,56,57,null,null,null,77,78,79,80,81,82,83,84,85,86,87,88,89,90,91,92,93,94,95,96,97,98,99,106,107,108,109,110,111]
[]
[]
[]
[null,null,"N°",null,"DIRECCION DE SALUD","TOTAL GENERAL",null,"TOTAL MASCULINO","TOTAL FEMENINO",null,"EDAD",null,"EDAD",null,"EDAD",null,"EDAD",null,"EDAD",null,"EDAD",null,"EDAD",null,"EDAD",null,"EDAD",null,"EDAD",null,"EDAD",null,"EDAD",null,"EDAD",null,"EDAD",null,"EDAD",null,"EDAD",null,"EDAD",null,"EDAD",null,"EDAD",null,"EDAD",null,"EDAD",null,"NACIMIENTOS","28 DIAS","POBLACION FEMENINA TOTAL","POBLACION FEMENINA"]
["UBIGEO",null,null,null,"PROVINCIA",null,null,null,null,null,0,null,1,null,2,null,3,null,4,null,"5 - 9",null,"10 - 14",null,"15 - 19",null,"20 - 24",null,"25 - 29",null,"30 - 34",null,"35 - 39",null,"40 - 44 ",null,"45 - 49",null,"50 - 54 ",null,"55 - 59 ",null,"60 - 64",null,"65 - 69 ",null,"70- 74 ",null,"75 - 79 ",null,"80 - +",null,null,null,null,"10-14","15-19","20-49","GESTANTES  ESPERADAS"]
[null,"Microredes",null,"RENAES","DISTRITO",null,null,null,null,null,"M","F","M","F","M","F","M","F","M","F","M","F","M","F","M","F","M","F","M","F","M","F","M","F","M","F","M","F","M","F","M","F","M","F","M","F","M","F","M","F","M","F"]
[150000,null,1,null,"HUAURA - OYON",242957,null,120300,122657,null,2153,2195,2053,2094,1989,2027,1956,1995,1951,1989,10264,10465,11480,11705,10914,11128,10591,10798,9036,9213,8616,8785,8649,8818,7360,7504,6777,6910,6044,6163,5157,5258,4325,4410,3580,3651,3023,3082,2153,2195,2229,2272,4474,332,120083,11223,10733,50931,5541]
[150800,null,2,150800,"PROVINCIA HUAURA",219059,null,108466,110593,null,1898,1936,1808,1843,1749,1784,1720,1754,1716,1750,9051,9229,10239,10440,9962,10157,9683,9872,8140,8299,7754,7906,7729,7881,6691,6823,6138,6258,5530,5638,4729,4821,3981,4059,3232,3296,2740,2793,1928,1966,2048,2088,3924,293,109036,10042,9820,46660,4858]
[150801,null,3,150802,"DISTRITO HUACHO",58532,null,28983,29549,null,460,470,433,441,414,423,405,412,402,409,2133,2174,2482,2530,2461,2510,2498,2547,2108,2149,2020,2060,2089,2129,1880,1916,1775,1810,1715,1749,1441,1470,1188,1212,981,1000,833,849,611,623,654,666,943,71,30026,2506,2443,12933,1168]
[null,"00",4,7639,"HOSPITAL HUACHO",45070,null,22316,22754,null,355,361,333,340,319,325,311,318,309,315,1641,1674,1911,1949,1895,1932,1924,1962,1624,1655,1556,1587,1609,1640,1447,1476,1367,1393,1321,1346,1110,1131,915,933,755,770,641,654,470,480,503,513,726,55,23120,1930,1881,9958,899]
[null,"02",5,5679,"P.S. MANZANARES",13462,null,6667,6795,null,106,108,100,101,96,97,93,95,93,94,491,501,570,582,566,578,574,585,484,494,464,473,480,489,432,441,408,417,395,402,332,338,273,279,226,230,192,195,141,143,151,153,217,16,6906,576,562,2975,269]
[150802,null,6,150802,"DISTRITO AMBAR",2737,null,1355,1382,null,19,20,24,24,27,28,30,30,32,33,170,173,149,151,102,105,108,110,82,83,83,85,81,82,66,68,76,77,67,69,55,56,52,53,47,48,35,35,23,24,27,28,44,3,1278,135,97,475,54]
[null,"01",7,5680,"C.S. AMBAR",1642,null,813,829,null,11,12,14,15,16,17,18,18,19,20,102,103,89,91,61,62,65,67,49,50,50,51,49,49,40,40,46,46,41,41,33,34,31,32,28,29,21,21,14,14,16,17,26,2,767,81,58,285,32]
[null,"01",8,5681,"P.S. AYNACA",1095,null,543,552,null,8,8,9,10,11,11,12,12,13,13,68,70,59,61,42,42,43,43,33,33,33,34,32,33,27,27,30,31,27,27,22,22,21,21,19,19,14,14,9,10,11,11,18,1,511,54,39,190,22]
[150803,null,9,150803,"DISTRITO CARQUIN",6801,null,3365,3436,null,62,64,59,61,57,59,56,57,55,57,269,275,276,281,281,286,326,332,296,302,290,295,248,253,234,239,180,184,173,177,138,141,109,111,100,102,69,71,41,42,46,47,132,10,2928,250,271,1248,163]
[null,"02",10,5664,"C.S. CARQUIN",6801,null,3365,3436,null,62,64,59,61,57,59,56,57,55,57,269,275,276,281,281,286,326,332,296,302,290,295,248,253,234,239,180,184,173,177,138,141,109,111,100,102,69,71,41,42,46,47,132,10,2928,250,271,1248,163]
[150804,null,11,150804,"DISTRITO CHECRAS",1781,null,880,901,null,15,15,13,14,12,13,12,12,12,12,67,69,81,83,52,53,35,36,44,44,40,41,61,62,54,56,52,53,68,70,51,51,52,54,43,44,57,59,31,31,28,29,34,2,880,74,40,288,42]
[null,"05",12,5663,"P.S. PUÑUN",1781,null,880,901,null,15,15,13,14,12,13,12,12,12,12,67,69,81,83,52,53,35,36,44,44,40,41,61,62,54,56,52,53,68,70,51,51,52,54,43,44,57,59,31,31,28,29,34,2,880,74,40,288,42]
[150805,null,13,150805,"DISTRITO HUALMAY",28589,null,14158,14431,null,248,252,233,237,223,227,218,222,217,222,1161,1183,1345,1372,1273,1297,1262,1286,1063,1083,1019,1038,1036,1056,917,935,769,784,718,733,643,655,520,530,440,449,327,333,252,257,274,280,510,38,14710,1345,1303,6318,631]
[null,"02",14,5665,"C.S. HUALMAY",14295,null,7077,7218,null,124,126,116,118,111,113,109,111,108,111,581,592,672,686,637,649,631,644,532,542,510,519,518,528,459,467,384,392,359,366,321,328,259,265,220,225,163,167,126,129,137,140,254,19,7354,672,652,3159,315]
[null,"02",15,5666,"P.S.DGO. MANDAMIENTO",10006,null,4954,5052,null,87,88,82,83,78,80,76,78,76,78,406,414,471,480,445,454,441,450,372,379,357,363,362,370,321,327,269,275,252,256,225,229,182,186,154,157,114,117,88,90,96,98,179,13,5149,471,456,2211,221]
[null,"02",16,5667,"P.S. CAMPO ALEGRE",4288,null,2125,2163,null,37,38,35,36,34,34,33,33,33,33,174,177,202,206,191,194,189,193,159,162,153,155,155,159,138,140,115,118,108,110,97,98,78,80,66,67,49,50,38,38,41,42,77,6,2207,202,195,948,95]
[150806,null,17,150806,"DISTRITO HUAURA                   ",35373,null,17516,17857,null,315,321,299,304,288,294,283,289,284,289,1526,1556,1809,1845,1872,1908,1655,1687,1363,1390,1280,1306,1225,1248,1061,1081,962,980,814,829,651,664,528,539,436,444,389,397,240,245,236,241,647,49,17576,1742,1816,7761,802]
[null,"01",18,5682,"C.S HUAURA",15918,null,7883,8035,null,142,144,135,137,130,132,128,130,128,130,686,700,815,830,842,859,745,760,613,626,576,587,551,562,477,487,433,441,366,374,293,298,238,242,196,200,175,178,108,110,106,108,291,22,7908,784,817,3492,361]
[null,"01",19,5686,"P.S. MAT. EL SOCORRO",13442,null,6654,6788,null,120,122,113,116,109,112,107,110,108,110,580,591,687,701,711,725,629,641,518,529,487,497,465,475,403,411,365,373,309,315,248,252,201,204,165,169,148,151,91,93,90,91,246,19,6679,662,690,2949,305]
[null,"01",20,5683,"P.S. HUMAYA",3537,null,1751,1786,null,32,32,30,30,29,29,28,29,28,29,153,155,181,185,187,190,165,169,136,139,128,131,122,125,106,108,96,98,81,83,65,67,53,54,44,44,39,40,24,25,24,24,65,5,1758,174,182,776,80]
[null,"01",21,5684,"P.S. VILCAHUAURA",2122,null,1050,1072,null,19,19,18,18,17,18,17,17,17,17,92,94,108,110,112,115,99,101,82,83,77,78,73,75,64,65,58,59,49,50,39,40,32,32,26,27,23,24,14,15,14,15,39,3,1055,105,109,466,48]
[null,"01",22,5685,"P.S. PEÑICO",354,null,170,184,null,3,3,3,3,3,3,3,3,3,3,15,16,18,19,19,20,16,17,13,14,12,13,12,13,10,11,9,10,8,8,6,7,5,6,4,5,4,4,2,3,2,3,6,0,176,17,18,78,8]
[150807,null,23,150807,"DISTRITO LEONCIO PRADO",1980,null,980,1000,null,15,15,18,19,21,21,22,23,23,24,109,111,78,80,73,75,84,85,72,73,60,61,62,63,52,53,58,59,56,57,36,37,37,37,30,31,29,30,21,21,24,25,34,2,897,80,62,348,42]
[null,"03",24,5778,"P.S. AUQUIMARCA",99,null,47,52,null,1,1,1,1,1,1,1,1,1,1,5,5,4,4,3,4,4,5,4,4,3,3,3,3,2,3,3,3,3,3,2,2,2,2,1,2,1,2,1,1,1,1,2,0,45,4,3,17,2]
[null,"03",25,5779,"P.S. PARAN",990,null,489,501,null,7,7,9,9,10,11,11,12,12,12,55,56,39,39,37,37,42,43,36,37,30,31,31,31,26,27,29,29,28,28,18,18,18,19,15,16,14,15,10,11,12,13,17,2,449,40,31,174,21]
[null,"03",26,6725,"P.S. SANTA CRUZ",436,null,213,223,null,3,4,4,4,4,5,5,5,5,5,24,24,17,17,16,16,18,19,16,16,13,14,14,15,12,12,13,13,12,13,8,8,8,8,6,7,6,7,4,5,5,6,7,0,197,18,14,77,9]
[null,"03",27,7757,"P.S. HUANANGUI",455,null,222,233,null,3,4,4,5,5,5,5,5,5,6,25,26,19,19,17,18,19,19,16,16,13,14,14,14,11,12,13,14,13,13,8,9,8,9,7,7,7,7,5,5,5,6,8,0,206,18,14,80,10]
[150808,null,28,150808,"DISTRITO PACCHO",2189,null,1084,1105,null,15,16,15,16,15,16,16,16,16,16,89,90,92,93,59,61,64,65,57,59,65,66,70,71,69,71,61,62,59,61,58,59,71,72,65,66,55,56,38,38,35,35,35,2,1049,95,44,359,43]
[null,"05",29,5650,"P.S. PACCHO",811,null,399,412,null,5,6,5,6,5,6,6,6,6,6,33,34,33,34,22,23,24,25,21,22,24,25,26,27,26,26,23,23,22,22,21,22,26,27,24,24,20,21,14,14,13,13,13,1,388,35,16,133,16]
[null,"05",30,5651,"P.S. LACSANGA",722,null,359,363,null,5,5,5,5,5,5,5,5,5,5,29,29,31,31,20,21,21,21,19,20,21,21,24,24,23,23,20,21,20,20,19,19,24,24,21,22,18,18,13,13,11,11,12,1,347,32,14,118,15]
[null,"05",31,5653,"P.S. AYARANGA",328,null,157,171,null,2,3,2,3,2,3,2,3,2,3,13,14,14,14,8,9,9,10,8,9,10,10,10,10,10,11,9,9,9,9,9,9,10,11,10,10,8,9,5,6,5,6,5,0,157,14,7,54,6]
[null,"05",32,5652,"P.S. MUZGA",328,null,157,171,null,2,3,2,3,2,3,2,3,2,3,13,14,14,14,8,9,9,10,8,9,10,10,10,10,10,11,9,9,9,9,9,9,10,11,10,10,8,9,5,6,5,6,5,0,157,14,7,54,6]
[150809,null,33,150809,"DISTRITO SANTA LEONOR",1455,null,721,734,null,11,11,10,10,10,10,10,11,10,11,67,69,84,85,52,54,45,45,33,34,35,36,45,46,43,43,45,45,50,51,35,35,39,39,29,29,28,28,23,24,17,18,26,2,682,72,54,239,32]
{"$rows_left_out":54}
{"sheet":"Pobla_EESS","index":2,"n_rows":60,"n_cols":16,"rows_kept":60,"cut":false,"hidden":false,"merged":[[50,4,52,4],[51,11,54,11],[54,3,54,5],[55,11,57,11],[58,10,58,12],[1,3,4,10],[7,3,7,8],[7,10,7,15],[15,3,15,4],[25,4,29,4],[25,11,30,11],[30,4,31,4],[23,3,23,8],[23,10,23,15],[31,10,31,12],[39,4,45,4],[39,11,41,11],[42,11,46,11],[46,4,49,4],[9,4,13,4],[9,11,11,11],[12,11,16,11],[16,3,16,5],[19,10,19,12],[32,3,32,5],[37,3,37,8],[37,10,37,15]]}
[]
[null,null,null,"POBLACIÓN SEGÚN DISTRITOS Y EE.SS - 2015"]
[]
[]
[]
[]
[]
[null,null,null,"SIN MICRORED",null,null,null,null,null,null,"MICRORED HUALMAY"]
[null,null,null,"DISTRITO","POBLACIÓN","EE.SS","POBLACIÓN","MASCULINO","FEMENINO",null,"DISTRITO","POBLACIÓN","EE.SS","POBLACIÓN","MASCULINO","FEMENINO"]
[null,null,null,"HUACHO",{"$f":"G10","v":45070},"HOSPITAL HUACHO",{"$f":"VLOOKUP($F10,Poblacion!$E$8:$I$87,2,FALSE)","v":45070},{"$f":"VLOOKUP($F10,Poblacion!$E$8:$I$87,4,FALSE)","v":22316},{"$f":"VLOOKUP($F10,Poblacion!$E$8:$I$87,5,FALSE)","v":22754},null,"HUALMAY",{"$f":"SUM(N10:N12)","v":28589},"C.S. HUALMAY",{"$f":"VLOOKUP($M10,Poblacion!$E$8:$I$87,2,FALSE)","v":14295},{"$f":"VLOOKUP($M10,Poblacion!$E$8:$I$87,4,FALSE)","v":7077},{"$f":"VLOOKUP($M10,Poblacion!$E$8:$I$87,5,FALSE)","v":7218}]
[null,null,null,"HUACHO",null,"CLINICA SAN PEDRO",0,null,null,null,"HUALMAY",null,"P.S.DGO. MANDAMIENTO",{"$f":"VLOOKUP($M11,Poblacion!$E$8:$I$87,2,FALSE)","v":10006},{"$f":"VLOOKUP($M11,Poblacion!$E$8:$I$87,4,FALSE)","v":4954},{"$f":"VLOOKUP($M11,Poblacion!$E$8:$I$87,5,FALSE)","v":5052}]
[null,null,null,"HUACHO",null,"ESSALUD GUSTAVO LA NATA",0,null,null,null,"HUALMAY",null,"P.S. CAMPO ALEGRE",{"$f":"VLOOKUP($M12,Poblacion!$E$8:$I$87,2,FALSE)","v":4288},{"$f":"VLOOKUP($M12,Poblacion!$E$8:$I$87,4,FALSE)","v":2125},{"$f":"VLOOKUP($M12,Poblacion!$E$8:$I$87,5,FALSE)","v":2163}]
[null,null,null,"HUACHO",null,"CLINICA SAN BARTOLOME",0,null,null,null,"S.MARIA",{"$f":"SUM(N13:N17)","v":33496},"C.S. SANTA MARIA",{"$f":"VLOOKUP($M13,Poblacion!$E$8:$I$87,2,FALSE)","v":9379},{"$f":"VLOOKUP($M13,Poblacion!$E$8:$I$87,4,FALSE)","v":4644},{"$f":"VLOOKUP($M13,Poblacion!$E$8:$I$87,5,FALSE)","v":4735}]
[null,null,null,"HUACHO",null,"GOLD ESTANDAR EIRL.",0,null,null,null,"S.MARIA",null,"P.S. CHONTA",{"$f":"VLOOKUP($M14,Poblacion!$E$8:$I$87,2,FALSE)","v":5024},{"$f":"VLOOKUP($M14,Poblacion!$E$8:$I$87,4,FALSE)","v":2488},{"$f":"VLOOKUP($M14,Poblacion!$E$8:$I$87,5,FALSE)","v":2536}]
[null,null,null,"CARQUIN",null,"INSITUTO NACIONAL PENITENCIARIO CARQUIN",0,null,null,null,"S.MARIA",null,"P.S. ZAPATA",{"$f":"VLOOKUP($M15,Poblacion!$E$8:$I$87,2,FALSE)","v":2680},{"$f":"VLOOKUP($M15,Poblacion!$E$8:$I$87,4,FALSE)","v":1327},{"$f":"VLOOKUP($M15,Poblacion!$E$8:$I$87,5,FALSE)","v":1353}]
[null,null,null,null,null,"OTROS ESTABLECIMIENTOS",0,null,null,null,"S.MARIA",null,"P.S. AMADO VELASQUEZ",{"$f":"VLOOKUP($M16,Poblacion!$E$8:$I$87,2,FALSE)","v":9044},{"$f":"VLOOKUP($M16,Poblacion!$E$8:$I$87,4,FALSE)","v":4478},{"$f":"VLOOKUP($M16,Poblacion!$E$8:$I$87,5,FALSE)","v":4566}]
[null,null,null,"TOTAL SIN MICRORED",null,null,{"$f":"SUM(G10:G16)","v":45070},{"$f":"SUM(H10:H16)","v":22316},{"$f":"SUM(I10:I16)","v":22754},null,"S.MARIA",null,"P.S. SAN BARTOLOME",{"$f":"VLOOKUP($M17,Poblacion!$E$8:$I$87,2,FALSE)","v":7369},{"$f":"VLOOKUP($M17,Poblacion!$E$8:$I$87,4,FALSE)","v":3648},{"$f":"VLOOKUP($M17,Poblacion!$E$8:$I$87,5,FALSE)","v":3721}]
[null,null,null,"Elaboración: Área de Estadística - RIS Huaura Oyón.",null,null,null,null,null,null,"CARQUIN",{"$f":"SUM(N18)","v":6801},"C.S. CARQUIN",{"$f":"VLOOKUP($M18,Poblacion!$E$8:$I$87,2,FALSE)","v":6801},{"$f":"VLOOKUP($M18,Poblacion!$E$8:$I$87,4,FALSE)","v":3365},{"$f":"VLOOKUP($M18,Poblacion!$E$8:$I$87,5,FALSE)","v":3436}]
[null,null,null,null,null,null,null,null,null,null,"HUACHO",{"$f":"SUM(N19)","v":13462},"P.S. MANZANARES",{"$f":"VLOOKUP($M19,Poblacion!$E$8:$I$87,2,FALSE)","v":13462},{"$f":"VLOOKUP($M19,Poblacion!$E$8:$I$87,4,FALSE)","v":6667},{"$f":"VLOOKUP($M19,Poblacion!$E$8:$I$87,5,FALSE)","v":6795}]
[null,null,null,null,null,null,null,null,null,null,"TOTAL MCR HUALMAY",null,"TOTAL MICRORED HUALMAY",{"$f":"SUM(N10:N19)","v":82348},{"$f":"SUM(O10:O19)","v":40773},{"$f":"SUM(P10:P19)","v":41575}]
[null,null,null,null,null,null,null,null,null,null,{"$f":"D18","v":"Elaboración: Área de Estadística - RIS Huaura Oyón."}]
[]
[]
[null,null,null,"MICRORED HUAURA",null,null,null,null,null,null,"MICRORED VEGUETA"]
[null,null,null,"DISTRITO","POBLACIÓN","EE.SS","POBLACIÓN","MASCULINO","FEMENINO",null,"DISTRITO","POBLACIÓN","EE.SS","POBLACIÓN","MASCULINO","FEMENINO"]
[null,null,null,"HUAURA",{"$f":"SUM(G26:G30)","v":35373},"C.S HUAURA",{"$f":"VLOOKUP($F26,Poblacion!$E$8:$I$87,2,FALSE)","v":15918},{"$f":"VLOOKUP($F26,Poblacion!$E$8:$I$87,4,FALSE)","v":7883},{"$f":"VLOOKUP($F26,Poblacion!$E$8:$I$87,5,FALSE)","v":8035},null,"VEGUETA",{"$f":"SUM(N26:N31)","v":22031},"C.S. VEGUETA",{"$f":"VLOOKUP($M26,Poblacion!$E$8:$I$87,2,FALSE)","v":6610},{"$f":"VLOOKUP($M26,Poblacion!$E$8:$I$87,4,FALSE)","v":3272},{"$f":"VLOOKUP($M26,Poblacion!$E$8:$I$87,5,FALSE)","v":3338}]
[null,null,null,"HUAURA",null,"P.S. MAT. EL SOCORRO",{"$f":"VLOOKUP($F27,Poblacion!$E$8:$I$87,2,FALSE)","v":13442},{"$f":"VLOOKUP($F27,Poblacion!$E$8:$I$87,4,FALSE)","v":6654},{"$f":"VLOOKUP($F27,Poblacion!$E$8:$I$87,5,FALSE)","v":6788},null,"VEGUETA",null,"P.S. MAZO",{"$f":"VLOOKUP($M27,Poblacion!$E$8:$I$87,2,FALSE)","v":2423},{"$f":"VLOOKUP($M27,Poblacion!$E$8:$I$87,4,FALSE)","v":1200},{"$f":"VLOOKUP($M27,Poblacion!$E$8:$I$87,5,FALSE)","v":1223}]
[null,null,null,"HUAURA",null,"P.S. HUMAYA",{"$f":"VLOOKUP($F28,Poblacion!$E$8:$I$87,2,FALSE)","v":3537},{"$f":"VLOOKUP($F28,Poblacion!$E$8:$I$87,4,FALSE)","v":1751},{"$f":"VLOOKUP($F28,Poblacion!$E$8:$I$87,5,FALSE)","v":1786},null,"VEGUETA",null,"P.S. PRIMAVERA",{"$f":"VLOOKUP($M28,Poblacion!$E$8:$I$87,2,FALSE)","v":2864},{"$f":"VLOOKUP($M28,Poblacion!$E$8:$I$87,4,FALSE)","v":1420},{"$f":"VLOOKUP($M28,Poblacion!$E$8:$I$87,5,FALSE)","v":1444}]
[null,null,null,"HUAURA",null,"P.S. VILCAHUAURA",{"$f":"VLOOKUP($F29,Poblacion!$E$8:$I$87,2,FALSE)","v":2122},{"$f":"VLOOKUP($F29,Poblacion!$E$8:$I$87,4,FALSE)","v":1050},{"$f":"VLOOKUP($F29,Poblacion!$E$8:$I$87,5,FALSE)","v":1072},null,"VEGUETA",null,"P.S. JOSE C. MARIATEGUI",{"$f":"VLOOKUP($M29,Poblacion!$E$8:$I$87,2,FALSE)","v":5948},{"$f":"VLOOKUP($M29,Poblacion!$E$8:$I$87,4,FALSE)","v":2945},{"$f":"VLOOKUP($M29,Poblacion!$E$8:$I$87,5,FALSE)","v":3003}]
[null,null,null,"HUAURA",null,"P.S. PEÑICO",{"$f":"VLOOKUP($F30,Poblacion!$E$8:$I$87,2,FALSE)","v":354},{"$f":"VLOOKUP($F30,Poblacion!$E$8:$I$87,4,FALSE)","v":170},{"$f":"VLOOKUP($F30,Poblacion!$E$8:$I$87,5,FALSE)","v":184},null,"VEGUETA",null,"P.S. MEDIO MUNDO",{"$f":"VLOOKUP($M30,Poblacion!$E$8:$I$87,2,FALSE)","v":3745},{"$f":"VLOOKUP($M30,Poblacion!$E$8:$I$87,4,FALSE)","v":1854},{"$f":"VLOOKUP($M30,Poblacion!$E$8:$I$87,5,FALSE)","v":1891}]
[null,null,null,"AMBAR",{"$f":"SUM(G31:G32)","v":2737},"C.S. AMBAR",{"$f":"VLOOKUP($F31,Poblacion!$E$8:$I$87,2,FALSE)","v":1642},{"$f":"VLOOKUP($F31,Poblacion!$E$8:$I$87,4,FALSE)","v":813},{"$f":"VLOOKUP($F31,Poblacion!$E$8:$I$87,5,FALSE)","v":829},null,"VEGUETA",null,"P.S. TIROLER",{"$f":"VLOOKUP($M31,Poblacion!$E$8:$I$87,2,FALSE)","v":441},{"$f":"VLOOKUP($M31,Poblacion!$E$8:$I$87,4,FALSE)","v":215},{"$f":"VLOOKUP($M31,Poblacion!$E$8:$I$87,5,FALSE)","v":226}]
[null,null,null,"AMBAR",null,"P.S. AYNACA",{"$f":"VLOOKUP($F32,Poblacion!$E$8:$I$87,2,FALSE)","v":1095},{"$f":"VLOOKUP($F32,Poblacion!$E$8:$I$87,4,FALSE)","v":543},{"$f":"VLOOKUP($F32,Poblacion!$E$8:$I$87,5,FALSE)","v":552},null,"TOTAL MCR VEGUETA",null,null,{"$f":"SUM(N26:N31)","v":22031},{"$f":"SUM(O26:O31)","v":10906},{"$f":"SUM(P26:P31)","v":11125}]
[null,null,null,"TOTAL MCR HUAURA",null,"TOTAL MICRORED HUAURA ",{"$f":"SUM(G26:G32)","v":38110},{"$f":"SUM(H26:H32)","v":18864},19246,null,{"$f":"K21","v":"Elaboración: Área de Estadística - RIS Huaura Oyón."}]
[null,null,null,{"$f":"K21","v":"Elaboración: Área de Estadística - RIS Huaura Oyón."}]
[]
[]
[]
[null,null,null,"MICRORED SAYAN",null,null,null,null,null,null,"MICRORED CHURIN OYÓN"]
[null,null,null,"DISTRITO","POBLACIÓN","EE.SS","POBLACIÓN","MASCULINO","FEMENINO",null,"DISTRITO","POBLACIÓN","EE.SS","POBLACIÓN","MASCULINO","FEMENINO"]
[null,null,null,"SAYAN",{"$f":"SUM(G40:G46)","v":24095},"C.S. SAYAN",{"$f":"VLOOKUP($F40,Poblacion!$E$8:$I$87,2,FALSE)","v":9637},{"$f":"VLOOKUP($F40,Poblacion!$E$8:$I$87,4,FALSE)","v":4770},{"$f":"VLOOKUP($F40,Poblacion!$E$8:$I$87,5,FALSE)","v":4867},null,"PACHANGARA",{"$f":"SUM(N40:N42)","v":3423},"C.S. CHURIN",{"$f":"VLOOKUP(M40,Poblacion!$E$5:$I$88,2,FALSE)","v":2739},{"$f":"VLOOKUP(M40,Poblacion!$E$5:$I$88,4,FALSE)","v":1355},{"$f":"VLOOKUP(M40,Poblacion!$E$5:$I$88,5,FALSE)","v":1384}]
{"$rows_left_out":20}