{"text_format":"1","workbook":"xlsx","n_sheets":3,"sheets":["Interfaz","Poblacion","Pobla_EESS"],"not_rendered":{"charts":0,"images":10,"macros":1,"external_links":1,"defined_names":4,"comments":0,"pivot_tables":0},"unopened":[],"bounds":{"document_bytes":16777216,"sheet_cells":100000,"rows_first":2000,"rows_last":500,"rows_between":2000,"halvings":0,"cell_chars":16384,"cell_head_chars":4096},"cells_cut":0,"cells_raw":0,"read":"whole","date_system":"1900"}

{"sheet":"Interfaz","index":0,"n_rows":27,"n_cols":18,"rows_kept":27,"cut":false,"hidden":false,"merged":[[4,2,7,11],[9,2,11,11]]}
[]
[]
[]
[]
[null,null,"POBLACIÓN ASIGNADA SEGÚN CENSOS INEI - RENIEC - PN - CNV - 2014"]
[]
[]
[]
[]
[null,null,"RED INTEGRADA DE SALUD HUAURA OYÓN "]
[]
[]
[]
[]
[]
[]
[]
[]
[]
[]
[]
["Elaboración: Área de Estadística - RIS Huaura Oyón."]
["NOTA: LA POBLACION ESTIMADA DE EDADES  SIMPLES Y GRUPOS DE EDAD DE DISTRITOS, CORRESPONDEN A CIFRAS REFERENCIALES HASTA OBTENER LAS CIFRAS DE LAS PROYECCIONES DEL INEI"]
[]
[]
["OFICINA DE GESTION DE LA INFORMACIÓN - MINISTERIO DE SALUD"]
[null,null,null,null,null,null,null,null,null,null,null,null,null,null,null,null,null,"Versión1.030"]

{"sheet":"Poblacion","index":1,"n_rows":93,"n_cols":93,"rows_kept":93,"cut":false,"hidden":false,"merged":[[5,50,5,51],[4,50,4,51],[4,48,4,49],[4,46,4,47],[4,57,4,60],[5,58,6,58],[5,59,6,59],[5,57,6,57],[5,60,6,60],[4,54,6,54],[4,55,6,55],[4,56,6,56],[4,52,4,53],[5,52,5,53],[5,46,5,47],[5,48,5,49],[1,20,1,43],[2,20,2,43],[4,36,4,37],[4,26,4,27],[3,20,3,43],[4,34,4,35],[4,28,4,29],[4,32,4,33],[4,42,4,43],[4,24,4,25],[4,7,6,7],[4,8,6,8],[5,28,5,29],[4,30,4,31],[5,30,5,31],[5,16,5,17],[5,18,5,19],[4,20,4,21],[4,22,4,23],[5,22,5,23],[5,20,5,21],[4,5,6,5],[4,44,4,45],[5,36,5,37],[5,32,5,33],[4,38,4,39],[5,38,5,39],[4,40,4,41],[5,24,5,25],[4,10,4,11],[4,12,4,13],[4,14,4,15],[4,16,4,17],[4,18,4,19],[5,10,5,11],[5,12,5,13],[5,14,5,15],[5,42,5,43],[5,26,5,27],[5,34,5,35],[5,44,5,45],[5,40,5,41]]}
[null,null,1,2,3,4,5,6,7,8,9,10,11,12,13,14,15,16,17,18,19,20,21,22,23,24,25,26,27,28,29,30,31,32,33,34,35,36,37,38,39,40,41,42,43,44,45,46,47,48,49,50,51,52,53,54,55,56,57,58,59,null,null,null,77,78,79,80,81,82,83,84,85,86,87,88,89,90,91,92,93,94,95,96,97,98,99,106,107,108,109,110,111]
[]
[]
[]
[null,null,"N°",null,"DIRECCION DE SALUD","TOTAL GENERAL",null,"TOTAL MASCULINO","TOTAL FEMENINO",null,"EDAD",null,"EDAD",null,"EDAD",null,"EDAD",null,"EDAD",null,"EDAD",null,"EDAD",null,"EDAD",null,"EDAD",null,"EDAD",null,"EDAD",null,"EDAD",null,"EDAD",null,"EDAD",null,"EDAD",null,"EDAD",null,"EDAD",null,"EDAD",null,"EDAD",null,"EDAD",null,"EDAD",null,"EDAD",null,"NACIMIENTOS","28 DIAS","POBLACION FEMENINA TOTAL","POBLACION FEMENINA"]
["UBIGEO",null,null,null,"PROVINCIA",null,null,null,null,null,0,null,1,null,2,null,3,null,4,null,"<5",null,"5 - 9",null,"10 - 14",null,"15 - 19",null,"20 - 24",null,"25 - 29",null,"30 - 34",null,"35 - 39",null,"40 - 44 ",null,"45 - 49",null,"50 - 54 ",null,"55 - 59 ",null,"60 - 64",null,"65 - 69 ",null,"70- 74 ",null,"75 - 79 ",null,"80 - +",null,null,null,null,"10-14","15-19","20-49","GESTANTES  ESPERADAS"]
[null,"Microredes",null,"RENAES","DISTRITO",null,null,null,null,null,"M","F","M","F","M","F","M","F","M","F","M","F","M","F","M","F","M","F","M","F","M","F","M","F","M","F","M","F","M","F","M","F","M","F","M","F","M","F","M","F","M","F","M","F"]
[150000,null,1,null,"RED HUAURA OYON",240832,null,119247,121585,null,2161,2203,2063,2104,2001,2040,1969,2007,1964,2003,10327,10531,4542,4631,13679,13948,4341,4425,10454,10659,8987,9163,8650,8820,8505,8671,7256,7398,6711,6843,5887,6002,4997,5095,4175,4257,3452,3519,2927,2985,2081,2122,2118,2159,4472,333,119060,11295,10847,50494,5537]
[150800,null,2,150800,"PROVINCIA HUAURA",217102,null,107496,109606,null,1905,1943,1817,1852,1760,1795,1731,1765,1727,1761,9109,9286,4029,4109,12343,12588,3979,4056,9557,9745,8095,8254,7786,7938,7601,7749,6597,6726,6078,6197,5385,5491,4581,4671,3842,3918,3115,3176,2652,2704,1863,1899,1944,1983,3925,294,108048,10101,9921,46239,4861]
[150801,null,3,150802,"DISTRITO HUACHO",58397,null,28914,29483,null,466,475,439,447,420,429,410,419,407,415,2163,2207,977,997,3042,3103,1003,1022,2486,2535,2114,2155,2045,2086,2071,2111,1868,1904,1772,1806,1683,1716,1407,1435,1156,1178,952,971,813,828,595,606,625,638,953,72,29962,2544,2491,12927,1180]
[null,"00",4,7639,"HOSPITAL G. HUACHO",44966,null,22263,22703,null,359,366,338,344,324,330,316,322,313,320,1665,1699,752,768,2343,2390,772,787,1914,1952,1628,1659,1575,1606,1594,1626,1438,1466,1364,1391,1296,1321,1083,1105,890,907,733,748,626,638,458,467,482,491,734,55,23071,1959,1918,9954,909]
[null,"02",5,5679,"C. S. MANZANARES",13431,null,6652,6779,null,107,109,101,103,97,98,95,96,94,95,498,508,225,229,698,714,231,235,572,583,486,496,470,480,476,486,430,438,408,415,387,395,324,330,266,271,219,223,187,190,137,139,144,146,219,17,6891,585,573,2973,271]
[150802,null,6,150802,"DISTRITO AMBAR",2761,null,1367,1394,null,20,20,24,25,28,28,31,31,33,33,173,178,66,67,152,154,40,41,108,111,83,84,85,87,81,82,66,68,76,78,67,68,54,55,51,52,46,47,34,35,23,23,26,27,44,3,1289,138,100,479,54]
[null,"01",7,5680,"C.S. AMBAR        ",1651,null,816,835,null,12,12,14,15,16,17,18,19,19,20,103,105,39,41,90,93,24,25,65,66,50,51,51,52,48,49,40,40,46,46,40,41,32,33,31,31,28,28,20,21,14,14,16,16,26,2,771,83,60,286,32]
[null,"01",8,5681,"P.S. AYNACA     ",1110,null,548,562,null,8,8,10,10,11,12,12,13,13,14,70,73,26,27,60,63,16,16,44,44,33,33,34,35,33,33,27,27,31,31,27,27,22,22,20,21,18,19,14,14,9,9,10,11,18,1,518,55,40,193,22]
[150803,null,9,150803,"DISTRITO  CARQUIN",6736,null,3332,3404,null,62,64,60,61,58,59,56,58,55,57,270,277,109,113,332,341,117,120,321,328,294,300,291,296,244,248,231,235,178,182,168,172,134,136,105,107,96,98,67,68,40,40,44,44,131,10,2912,252,275,1241,162]
[null,"02",10,5664,"P.S. CARQUIN",6736,null,3332,3404,null,62,64,60,61,58,59,56,58,55,57,270,277,109,113,332,341,117,120,321,328,294,300,291,296,244,248,231,235,178,182,168,172,134,136,105,107,96,98,67,68,40,40,44,44,131,10,2912,252,275,1241,162]
[150804,null,11,150804,"DISTRITO CHECRAS",1748,null,863,885,null,15,15,13,14,12,13,12,12,12,12,67,69,33,33,82,87,17,18,35,35,43,44,40,41,59,61,53,55,51,52,66,68,49,49,51,51,41,42,55,57,30,30,27,27,33,2,866,75,41,286,41]
[null,"05",12,5663,"P.S. PUÑUN",1748,null,863,885,null,15,15,13,14,12,13,12,12,12,12,67,69,33,33,82,87,17,18,35,35,43,44,40,41,59,61,53,55,51,52,66,68,49,49,51,51,41,42,55,57,30,30,27,27,33,2,866,75,41,286,41]
[150805,null,13,150805,"DISTRITO HUALMAY",28486,null,14105,14381,null,250,255,235,240,225,230,220,225,220,224,1176,1196,532,543,1610,1642,511,520,1252,1277,1063,1084,1028,1049,1024,1045,909,927,766,780,703,717,626,638,504,514,426,435,318,324,245,249,262,267,513,39,14653,1361,1324,6296,636]
[null,"02",14,5665,"C.S. HUALMAY      ",14243,null,7052,7191,null,125,127,118,120,113,115,110,112,110,112,587,599,266,272,806,821,255,260,626,639,531,542,513,524,512,522,455,463,383,390,352,358,313,319,252,257,213,218,159,162,122,125,131,134,256,19,7326,681,662,3148,318]
[null,"02",15,5666,"P.S. DGO. MANDAMIENTO  ",9970,null,4938,5032,null,88,89,82,84,79,80,77,79,77,78,412,418,186,190,564,574,179,182,438,447,372,379,360,368,359,366,318,325,268,273,246,251,219,223,176,180,149,152,111,114,86,87,92,93,180,14,5129,476,463,2204,223]
[null,"02",16,5667,"P.S. CAMPO ALEGRE       ",4273,null,2117,2156,null,38,38,35,36,34,34,33,34,33,34,176,180,80,81,242,245,77,78,188,191,160,163,154,158,153,157,136,139,115,117,105,108,94,96,76,77,64,65,48,48,37,37,39,40,77,6,2198,204,199,944,95]
[150806,null,17,150806,"DISTRITO  HUAURA",34967,null,17311,17656,null,315,322,299,305,289,295,284,290,284,290,1530,1559,696,709,2261,2307,737,753,1627,1659,1350,1377,1280,1306,1199,1223,1041,1062,948,967,788,804,628,640,508,517,418,426,375,382,231,235,223,228,647,49,17359,1744,1827,7655,802]
[null,"01",18,5682,"C.S. HUAURA ",16084,null,7965,8119,null,145,148,138,140,133,136,131,133,131,133,705,716,319,326,1042,1061,339,346,748,763,621,633,589,601,552,563,479,489,436,445,362,370,289,294,233,238,192,195,172,176,106,108,103,105,298,22,7985,803,840,3522,370]
[null,"01",19,5686,"C.MAT.INF.EL SOCORRO ",12658,null,6268,6390,null,114,117,108,111,104,107,103,105,103,105,553,565,252,257,819,834,268,272,589,601,489,498,463,473,434,442,377,384,343,350,285,291,227,232,184,187,152,154,136,138,84,85,81,82,234,18,6284,631,661,2771,290]
[null,"01",20,5683,"P.S. HUMAYA  ",3637,null,1804,1833,null,33,33,31,32,30,31,30,30,30,30,160,161,73,74,236,238,77,78,169,173,140,143,133,135,125,127,108,111,99,100,82,84,65,67,53,54,44,44,39,40,24,24,23,24,67,5,1805,181,190,796,83]
[null,"01",21,5684,"P.S. VILCAHUAURA ",2098,null,1040,1058,null,19,19,18,18,17,18,17,17,17,17,92,94,41,43,136,137,44,45,98,99,82,83,77,79,72,73,62,64,57,58,48,48,38,38,31,31,25,26,22,23,14,14,13,14,39,3,1042,105,110,459,48]
[null,"01",22,5685,"P.S. PEÑICO  ",490,null,238,252,null,4,5,4,4,4,4,4,4,4,4,20,23,10,10,30,35,10,11,23,23,19,19,18,18,17,17,14,15,13,14,11,11,9,9,7,7,6,6,5,6,3,4,3,3,9,1,243,24,26,107,11]
[150807,null,23,150807,"DISTRITO LEONCIO PRADO",1994,null,985,1009,null,15,15,18,19,21,22,23,23,24,24,111,114,34,36,90,91,30,32,84,86,73,74,61,63,62,63,52,53,58,60,55,57,36,36,36,37,30,30,29,29,20,21,23,24,33,2,906,82,64,351,41]
[null,"03",24,5778,"P.S. AUQUIMARCA",100,null,48,52,null,1,1,1,1,1,1,1,1,1,1,5,5,2,2,6,6,2,2,4,4,3,3,2,3,3,3,2,3,3,3,3,3,2,2,2,2,1,2,1,2,1,1,1,1,2,0,45,4,3,18,2]
[null,"03",25,5779,"P.S. PARAN",997,null,491,506,null,7,8,9,9,11,11,11,12,12,12,56,58,17,17,43,48,16,16,42,42,37,37,31,31,31,31,26,27,29,30,27,28,17,18,18,18,15,15,14,15,10,11,12,12,16,1,454,41,32,175,21]
[null,"03",26,6725,"P.S. SANTA CRUZ",438,null,213,225,null,3,3,4,4,4,5,5,5,5,6,23,26,7,8,18,18,6,6,19,20,17,17,15,15,14,14,11,12,13,13,12,13,8,8,8,8,6,7,6,7,4,5,5,5,7,0,199,18,14,77,9]
[null,"03",27,7757,"P.S. HUANANGUI",459,null,216,243,null,3,4,4,5,5,5,5,6,5,6,24,28,8,9,18,24,6,8,19,20,16,17,13,14,14,15,12,12,13,14,13,13,8,9,8,9,7,7,6,7,4,5,5,6,8,1,208,19,15,81,9]
[150808,null,28,150808,"DISTRITO  PACCHO",2188,null,1080,1108,null,15,16,15,16,16,16,16,16,17,17,90,93,39,40,91,96,23,23,64,65,58,59,66,67,69,71,69,71,61,62,58,60,57,58,69,71,63,65,54,55,37,37,33,34,34,2,1051,97,45,361,42]
[null,"05",29,5650,"C.S. PACCHO ",875,null,428,447,null,6,6,6,6,6,7,6,7,6,7,35,38,15,16,36,39,8,10,26,27,23,24,27,27,28,29,28,28,24,25,23,23,23,23,28,28,25,26,22,22,14,15,13,14,13,1,420,39,18,145,17]
[null,"05",30,5651,"P.S. LACSANGA  ",548,null,266,282,null,4,4,4,4,4,4,4,4,4,5,21,25,10,10,22,24,6,6,16,16,14,15,16,17,17,17,17,18,15,16,15,15,14,15,17,18,16,16,13,14,9,10,8,9,9,1,263,24,11,90,11]
[null,"05",31,5653,"P.S. AYARANGA  ",328,null,156,172,null,2,3,2,3,2,3,2,3,2,3,13,15,6,6,13,15,3,4,9,9,9,9,10,10,10,11,10,11,9,9,9,9,8,9,10,11,9,10,8,8,5,6,5,5,5,0,158,15,7,54,6]
[null,"05",32,5652,"P.S. MUZGA ",437,null,211,226,null,3,3,3,3,3,3,3,3,3,4,16,20,8,8,17,21,4,5,13,13,11,12,13,13,14,14,14,14,12,13,12,12,11,12,14,14,13,13,11,11,7,8,6,7,7,0,210,19,9,72,8]
[150809,null,33,150809,"DISTRITO  SANTA LEONOR",1471,null,725,746,null,11,12,10,11,10,11,10,11,11,12,70,70,35,36,84,89,19,20,45,46,34,34,36,37,45,46,43,44,45,46,50,50,34,35,38,39,28,29,27,28,23,23,17,17,26,2,690,74,56,241,32]
{"$rows_left_out":54}
{"sheet":"Pobla_EESS","index":2,"n_rows":60,"n_cols":16,"rows_kept":60,"cut":false,"hidden":false,"merged":[[39,4,45,4],[39,11,41,11],[42,11,46,11],[46,4,49,4],[9,4,13,4],[9,11,11,11],[12,11,16,11],[16,3,16,5],[19,10,19,12],[32,3,32,5],[37,3,37,8],[37,10,37,15],[1,3,4,10],[7,3,7,8],[7,10,7,15],[15,3,15,4],[25,4,29,4],[25,11,30,11],[30,4,31,4],[23,3,23,8],[23,10,23,15],[31,10,31,12],[50,4,52,4],[51,11,54,11],[54,3,54,5],[55,11,57,11],[58,10,58,12]]}
[]
[null,null,null,"POBLACIÓN SEGÚN DISTRITOS Y EE.SS - 2014"]
[]
[]
[]
[]
[]
[null,null,null,"SIN MICRORED",null,null,null,null,null,null,"MICRORED HUALMAY"]
[null,null,null,"DISTRITO","POBLACIÓN","EE.SS","POBLACIÓN","MASCULINO","FEMENINO",null,"DISTRITO","POBLACIÓN","EE.SS","POBLACIÓN","MASCULINO","FEMENINO"]
[null,null,null,"HUACHO",{"$f":"G10","v":44966},"HOSPITAL G. HUACHO",{"$f":"VLOOKUP($F10,Poblacion!$E$8:$I$87,2,FALSE)","v":44966},{"$f":"VLOOKUP($F10,Poblacion!$E$8:$I$87,4,FALSE)","v":22263},{"$f":"VLOOKUP($F10,Poblacion!$E$8:$I$87,5,FALSE)","v":22703},null,"HUALMAY",{"$f":"SUM(N10:N12)","v":28486},"C.S. HUALMAY      ",{"$f":"VLOOKUP($M10,Poblacion!$E$8:$I$87,2,FALSE)","v":14243},{"$f":"VLOOKUP($M10,Poblacion!$E$8:$I$87,4,FALSE)","v":7052},{"$f":"VLOOKUP($M10,Poblacion!$E$8:$I$87,5,FALSE)","v":7191}]
[null,null,null,"HUACHO",null,"CLINICA SAN PEDRO",0,null,null,null,"HUALMAY",null,"P.S. DGO. MANDAMIENTO  ",{"$f":"VLOOKUP($M11,Poblacion!$E$8:$I$87,2,FALSE)","v":9970},{"$f":"VLOOKUP($M11,Poblacion!$E$8:$I$87,4,FALSE)","v":4938},{"$f":"VLOOKUP($M11,Poblacion!$E$8:$I$87,5,FALSE)","v":5032}]
[null,null,null,"HUACHO",null,"ESSALUD GUSTAVO LA NATA",0,null,null,null,"HUALMAY",null,"P.S. CAMPO ALEGRE       ",{"$f":"VLOOKUP($M12,Poblacion!$E$8:$I$87,2,FALSE)","v":4273},{"$f":"VLOOKUP($M12,Poblacion!$E$8:$I$87,4,FALSE)","v":2117},{"$f":"VLOOKUP($M12,Poblacion!$E$8:$I$87,5,FALSE)","v":2156}]
[null,null,null,"HUACHO",null,"CLINICA SAN BARTOLOME",0,null,null,null,"S.MARIA",{"$f":"SUM(N13:N17)","v":32831},"C.S. SANTA MARIA ",{"$f":"VLOOKUP($M13,Poblacion!$E$8:$I$87,2,FALSE)","v":9521},{"$f":"VLOOKUP($M13,Poblacion!$E$8:$I$87,4,FALSE)","v":4716},{"$f":"VLOOKUP($M13,Poblacion!$E$8:$I$87,5,FALSE)","v":4805}]
[null,null,null,"HUACHO",null,"GOLD ESTANDAR EIRL.",0,null,null,null,"S.MARIA",null,"P.S. CHONTA  ",{"$f":"VLOOKUP($M14,Poblacion!$E$8:$I$87,2,FALSE)","v":4596},{"$f":"VLOOKUP($M14,Poblacion!$E$8:$I$87,4,FALSE)","v":2279},{"$f":"VLOOKUP($M14,Poblacion!$E$8:$I$87,5,FALSE)","v":2317}]
[null,null,null,"CARQUIN",null,"INSITUTO NACIONAL PENITENCIARIO CARQUIN",0,null,null,null,"S.MARIA",null,"P.S. ZAPATA ",{"$f":"VLOOKUP($M15,Poblacion!$E$8:$I$87,2,FALSE)","v":2299},{"$f":"VLOOKUP($M15,Poblacion!$E$8:$I$87,4,FALSE)","v":1140},{"$f":"VLOOKUP($M15,Poblacion!$E$8:$I$87,5,FALSE)","v":1159}]
[null,null,null,null,null,"OTROS ESTABLECIMIENTOS",0,null,null,null,"S.MARIA",null,"P.S. AMADO VELASQUEZ  ",{"$f":"VLOOKUP($M16,Poblacion!$E$8:$I$87,2,FALSE)","v":8536},{"$f":"VLOOKUP($M16,Poblacion!$E$8:$I$87,4,FALSE)","v":4226},{"$f":"VLOOKUP($M16,Poblacion!$E$8:$I$87,5,FALSE)","v":4310}]
[null,null,null,"TOTAL SIN MICRORED",null,null,{"$f":"SUM(G10:G16)","v":44966},{"$f":"SUM(H10:H16)","v":22263},{"$f":"SUM(I10:I16)","v":22703},null,"S.MARIA",null,"P.S. SAN BARTOLOME  ",{"$f":"VLOOKUP($M17,Poblacion!$E$8:$I$87,2,FALSE)","v":7879},{"$f":"VLOOKUP($M17,Poblacion!$E$8:$I$87,4,FALSE)","v":3902},{"$f":"VLOOKUP($M17,Poblacion!$E$8:$I$87,5,FALSE)","v":3977}]
[null,null,null,"Elaboración: Área de Estadística - RIS Huaura Oyón.",null,null,null,null,null,null,"CARQUIN",{"$f":"SUM(N18)","v":6736},"P.S. CARQUIN",{"$f":"VLOOKUP($M18,Poblacion!$E$8:$I$87,2,FALSE)","v":6736},{"$f":"VLOOKUP($M18,Poblacion!$E$8:$I$87,4,FALSE)","v":3332},{"$f":"VLOOKUP($M18,Poblacion!$E$8:$I$87,5,FALSE)","v":3404}]
[null,null,null,null,null,null,null,null,null,null,"HUACHO",{"$f":"SUM(N19)","v":13431},"C. S. MANZANARES",{"$f":"VLOOKUP($M19,Poblacion!$E$8:$I$87,2,FALSE)","v":13431},{"$f":"VLOOKUP($M19,Poblacion!$E$8:$I$87,4,FALSE)","v":6652},{"$f":"VLOOKUP($M19,Poblacion!$E$8:$I$87,5,FALSE)","v":6779}]
[null,null,null,null,null,null,null,null,null,null,"TOTAL MCR HUALMAY",null,"TOTAL MICRORED HUALMAY",{"$f":"SUM(N10:N19)","v":81484},{"$f":"SUM(O10:O19)","v":40354},{"$f":"SUM(P10:P19)","v":41130}]
[null,null,null,null,null,null,null,null,null,null,{"$f":"D18","v":"Elaboración: Área de Estadística - RIS Huaura Oyón."}]
[]
[]
[null,null,null,"MICRORED HUAURA",null,null,null,null,null,null,"MICRORED VEGUETA"]
[null,null,null,"DISTRITO","POBLACIÓN","EE.SS","POBLACIÓN","MASCULINO","FEMENINO",null,"DISTRITO","POBLACIÓN","EE.SS","POBLACIÓN","MASCULINO","FEMENINO"]
[null,null,null,"HUAURA",{"$f":"SUM(G26:G30)","v":34967},"C.S. HUAURA ",{"$f":"VLOOKUP($F26,Poblacion!$E$8:$I$87,2,FALSE)","v":16084},{"$f":"VLOOKUP($F26,Poblacion!$E$8:$I$87,4,FALSE)","v":7965},{"$f":"VLOOKUP($F26,Poblacion!$E$8:$I$87,5,FALSE)","v":8119},null,"VEGUETA",{"$f":"SUM(N26:N31)","v":21604},"C.S. VEGUETA ",{"$f":"VLOOKUP($M26,Poblacion!$E$8:$I$87,2,FALSE)","v":6481},{"$f":"VLOOKUP($M26,Poblacion!$E$8:$I$87,4,FALSE)","v":3207},{"$f":"VLOOKUP($M26,Poblacion!$E$8:$I$87,5,FALSE)","v":3274}]
[null,null,null,"HUAURA",null,"C.MAT.INF.EL SOCORRO ",{"$f":"VLOOKUP($F27,Poblacion!$E$8:$I$87,2,FALSE)","v":12658},{"$f":"VLOOKUP($F27,Poblacion!$E$8:$I$87,4,FALSE)","v":6268},{"$f":"VLOOKUP($F27,Poblacion!$E$8:$I$87,5,FALSE)","v":6390},null,"VEGUETA",null,"P.S. MAZO ",{"$f":"VLOOKUP($M27,Poblacion!$E$8:$I$87,2,FALSE)","v":2160},{"$f":"VLOOKUP($M27,Poblacion!$E$8:$I$87,4,FALSE)","v":1069},{"$f":"VLOOKUP($M27,Poblacion!$E$8:$I$87,5,FALSE)","v":1091}]
[null,null,null,"HUAURA",null,"P.S. HUMAYA  ",{"$f":"VLOOKUP($F28,Poblacion!$E$8:$I$87,2,FALSE)","v":3637},{"$f":"VLOOKUP($F28,Poblacion!$E$8:$I$87,4,FALSE)","v":1804},{"$f":"VLOOKUP($F28,Poblacion!$E$8:$I$87,5,FALSE)","v":1833},null,"VEGUETA",null,"P.S. PRIMAVERA ",{"$f":"VLOOKUP($M28,Poblacion!$E$8:$I$87,2,FALSE)","v":2809},{"$f":"VLOOKUP($M28,Poblacion!$E$8:$I$87,4,FALSE)","v":1389},{"$f":"VLOOKUP($M28,Poblacion!$E$8:$I$87,5,FALSE)","v":1420}]
[null,null,null,"HUAURA",null,"P.S. VILCAHUAURA ",{"$f":"VLOOKUP($F29,Poblacion!$E$8:$I$87,2,FALSE)","v":2098},{"$f":"VLOOKUP($F29,Poblacion!$E$8:$I$87,4,FALSE)","v":1040},{"$f":"VLOOKUP($F29,Poblacion!$E$8:$I$87,5,FALSE)","v":1058},null,"VEGUETA",null,"P.S.  JOSE C.MARIATEGUI ",{"$f":"VLOOKUP($M29,Poblacion!$E$8:$I$87,2,FALSE)","v":5185},{"$f":"VLOOKUP($M29,Poblacion!$E$8:$I$87,4,FALSE)","v":2570},{"$f":"VLOOKUP($M29,Poblacion!$E$8:$I$87,5,FALSE)","v":2615}]
[null,null,null,"HUAURA",null,"P.S. PEÑICO  ",{"$f":"VLOOKUP($F30,Poblacion!$E$8:$I$87,2,FALSE)","v":490},{"$f":"VLOOKUP($F30,Poblacion!$E$8:$I$87,4,FALSE)","v":238},{"$f":"VLOOKUP($F30,Poblacion!$E$8:$I$87,5,FALSE)","v":252},null,"VEGUETA",null,"P.S. MEDIO MUNDO ",{"$f":"VLOOKUP($M30,Poblacion!$E$8:$I$87,2,FALSE)","v":4105},{"$f":"VLOOKUP($M30,Poblacion!$E$8:$I$87,4,FALSE)","v":2036},{"$f":"VLOOKUP($M30,Poblacion!$E$8:$I$87,5,FALSE)","v":2069}]
[null,null,null,"AMBAR",{"$f":"SUM(G31:G32)","v":2761},"C.S. AMBAR        ",{"$f":"VLOOKUP($F31,Poblacion!$E$8:$I$87,2,FALSE)","v":1651},{"$f":"VLOOKUP($F31,Poblacion!$E$8:$I$87,4,FALSE)","v":816},{"$f":"VLOOKUP($F31,Poblacion!$E$8:$I$87,5,FALSE)","v":835},null,"VEGUETA",null,"P.S. TIROLER  ",{"$f":"VLOOKUP($M31,Poblacion!$E$8:$I$87,2,FALSE)","v":864},{"$f":"VLOOKUP($M31,Poblacion!$E$8:$I$87,4,FALSE)","v":423},{"$f":"VLOOKUP($M31,Poblacion!$E$8:$I$87,5,FALSE)","v":441}]
[null,null,null,"AMBAR",null,"P.S. AYNACA     ",{"$f":"VLOOKUP($F32,Poblacion!$E$8:$I$87,2,FALSE)","v":1110},{"$f":"VLOOKUP($F32,Poblacion!$E$8:$I$87,4,FALSE)","v":548},{"$f":"VLOOKUP($F32,Poblacion!$E$8:$I$87,5,FALSE)","v":562},null,"TOTAL MCR VEGUETA",null,null,{"$f":"SUM(N26:N31)","v":21604},{"$f":"SUM(O26:O31)","v":10694},{"$f":"SUM(P26:P31)","v":10910}]
[null,null,null,"TOTAL MCR HUAURA",null,"TOTAL MICRORED HUAURA ",{"$f":"SUM(G26:G32)","v":37728},18679,{"$f":"SUM(I26:I32)","v":19049},null,{"$f":"K21","v":"Elaboración: Área de Estadística - RIS Huaura Oyón."}]
[null,null,null,{"$f":"K21","v":"Elaboración: Área de Estadística - RIS Huaura Oyón."}]
[]
[]
[]
[null,null,null,"MICRORED SAYAN",null,null,null,null,null,null,"MICRORED CHURIN OYÓN"]
[null,null,null,"DISTRITO","POBLACIÓN","EE.SS","POBLACIÓN","MASCULINO","FEMENINO",null,"DISTRITO","POBLACIÓN","EE.SS","POBLACIÓN","MASCULINO","FEMENINO"]
[null,null,null,"SAYAN",{"$f":"SUM(G40:G46)","v":23919},"C.S. SAYAN",{"$f":"VLOOKUP($F40,Poblacion!$E$8:$I$87,2,FALSE)","v":9568},{"$f":"VLOOKUP($F40,Poblacion!$E$8:$I$87,4,FALSE)","v":4741},{"$f":"VLOOKUP($F40,Poblacion!$E$8:$I$87,5,FALSE)","v":4827},null,"PACHANGARA",{"$f":"SUM(N40:N42)","v":3429},"C.S. CHURIN ",{"$f":"VLOOKUP(M40,Poblacion!$E$5:$I$88,2,FALSE)","v":2675},{"$f":"VLOOKUP(M40,Poblacion!$E$5:$I$88,4,FALSE)","v":1325},{"$f":"VLOOKUP(M40,Poblacion!$E$5:$I$88,5,FALSE)","v":1350}]
{"$rows_left_out":20}