{"text_format":"1","workbook":"xlsx","n_sheets":3,"sheets":["Interfaz","Poblacion","Pobla_EESS"],"not_rendered":{"charts":0,"images":10,"macros":1,"external_links":1,"defined_names":4,"comments":0,"pivot_tables":0},"unopened":[],"bounds":{"document_bytes":16777216,"sheet_cells":100000,"rows_first":2000,"rows_last":500,"rows_between":2000,"halvings":0,"cell_chars":16384,"cell_head_chars":4096},"cells_cut":0,"cells_raw":0,"read":"whole","date_system":"1900"}

{"sheet":"Interfaz","index":0,"n_rows":27,"n_cols":18,"rows_kept":27,"cut":false,"hidden":false,"merged":[[4,2,7,11],[9,2,11,11]]}
[]
[]
[]
[]
[null,null,"POBLACIÓN ASIGNADA SEGÚN CENSOS INEI - RENIEC - PN - CNV - 2013"]
[]
[]
[]
[]
[null,null,"RED INTEGRADA DE SALUD HUAURA OYÓN "]
[]
[]
[]
[]
[]
[]
[]
[]
[]
[]
{"$rows_left_out":8}
{"sheet":"Poblacion","index":1,"n_rows":93,"n_cols":83,"rows_kept":93,"cut":false,"hidden":false,"merged":[[5,32,5,33],[5,16,5,17],[5,24,5,25],[5,34,5,35],[5,30,5,31],[4,5,6,5],[4,34,4,35],[5,26,5,27],[5,22,5,23],[4,28,4,29],[5,28,5,29],[4,30,4,31],[5,14,5,15],[4,7,6,7],[4,8,6,8],[5,18,5,19],[4,20,4,21],[5,20,5,21],[4,10,4,11],[4,12,4,13],[5,12,5,13],[1,10,1,33],[2,10,2,33],[4,26,4,27],[4,16,4,17],[3,10,3,33],[4,24,4,25],[4,18,4,19],[4,22,4,23],[4,32,4,33],[4,14,4,15],[4,40,4,41],[4,38,4,39],[4,36,4,37],[4,47,4,50],[5,48,6,48],[5,49,6,49],[5,47,6,47],[5,50,6,50],[4,44,6,44],[4,45,6,45],[4,46,6,46],[4,42,4,43],[5,42,5,43],[5,36,5,37],[5,38,5,39],[5,40,5,41]]}
[null,null,1,2,3,4,5,6,7,8,9,10,11,12,13,14,15,16,17,18,19,20,21,22,23,24,25,26,27,28,29,30,31,32,33,34,35,36,37,38,39,40,41,42,43,44,45,46,47,48,49,null,null,null,77,78,79,80,81,82,83,84,85,86,87,88,89,90,91,92,93,94,95,96,97,98,99,106,107,108,109,110,111]
[]
[]
[]
[null,null,"N°",null,"DIRECCION DE SALUD","TOTAL GENERAL",null,"TOTAL MASCULINO","TOTAL FEMENINO",null,"EDAD",null,"EDAD",null,"EDAD",null,"EDAD",null,"EDAD",null,"EDAD",null,"EDAD",null,"EDAD",null,"EDAD",null,"EDAD",null,"EDAD",null,"EDAD",null,"EDAD",null,"EDAD",null,"EDAD",null,"EDAD",null,"EDAD",null,"NACIMIENTOS","28 DIAS","POBLACION FEMENINA TOTAL","POBLACION FEMENINA"]
["UBIGEO",null,null,null,"PROVINCIA",null,null,null,null,null,"<5",null,"5 - 9",null,"10 - 14",null,"15 - 19",null,"20 - 24",null,"25 - 29",null,"30 - 34",null,"35 - 39",null,"40 - 44 ",null,"45 - 49",null,"50 - 54 ",null,"55 - 59 ",null,"60 - 64",null,"65 - 69 ",null,"70- 74 ",null,"75 - 79 ",null,"80 - +",null,null,null,null,"10-14","15-19","20-49","GESTANTES  ESPERADAS"]
[null,"Microredes",null,"RENAES","DISTRITO",null,null,null,null,null,"M","F","M","F","M","F","M","F","M","F","M","F","M","F","M","F","M","F","M","F","M","F","M","F","M","F","M","F","M","F","M","F","M","F"]
[150000,null,1,null,"RED HUAURA - OYON",238702,null,118193.2953,120508.7047,null,10220.391149999999,10420.608850000001,10392.208199999999,10595.791800000001,11601.3645,11828.6355,11165.137349999999,11383.862650000001,10210.9833,10411.0167,9008.7590999999993,9185.2409000000007,8701.2709500000001,8871.7290499999999,8287.8207000000002,8450.1792999999998,7197.9955499999996,7339.0044500000004,6649.3693499999999,6779.6306500000001,5694.2249999999995,5805.7750000000005,4852.4699999999993,4947.5300000000007,4021.6082999999999,4100.3917000000001,3330.3788999999997,3395.6211000000003,2842.6561499999998,2898.3438500000002,2009.81385,2049.18615,2006.84295,2046.15705,4452,335,118031,11363,11000,50012,5514]
[150800,null,2,150800,"PROVINCIA HUAURA",215138,null,106525.58070000001,108612.41929999999,null,8995.39005,9171.60995,9163.7410499999987,9343.2589500000013,10346.159249999999,10548.840750000001,10190.682149999999,10390.317850000001,9335.0629499999995,9517.9370500000005,8115.5084999999999,8274.4915000000001,7831.78755,7985.21245,7406.4537,7551.5463,6543.4072499999993,6671.5927500000007,6022.0142999999998,6139.9857000000002,5208.9780000000001,5311.0219999999999,4447.9324500000002,4535.0675499999998,3699.7608,3772.2392,3004.5701999999997,3063.4298000000003,2574.28485,2624.71515,1797.8896499999998,1833.1103500000002,1841.9579999999999,1878.0420000000001,3915,295,107054,10158,10056,45781,4849]
[150801,null,3,150802,"DISTRITO HUACHO",58252,null,28843.477800000004,29408.522199999996,null,2175.6891000000001,2218.3108999999999,2194.9999499999999,2238.0000500000001,2550.0225,2599.9775,2561.41095,2611.58905,2448.5167499999998,2496.4832500000002,2136.5722499999997,2178.4277500000003,2074.1833499999998,2114.8166500000002,2034.0762,2073.9238,1867.21065,1903.78935,1768.6758,1803.3242,1639.9367999999999,1672.0632000000001,1376.5170000000001,1403.4829999999999,1121.0195999999999,1142.9804000000001,924.9402,943.0598,794.71574999999996,810.28425000000004,578.33519999999999,589.66480000000001,596.65575000000001,608.34424999999999,964,73,29892,2582,2549,12909,1194]
[null,"00",4,7639,"HOSPITAL DOCENTE HUACHO  ",44854,null,22209.458099999996,22644.541900000004,null,1675.0924499999999,1707.9075500000001,1689.94695,1723.05305,1963.2697499999999,2001.7302500000001,1971.6872999999998,2010.3127000000002,1885.5311999999999,1922.4688000000001,1645.8786,1678.1214,1597.3538999999998,1628.6461000000002,1566.1594499999999,1596.8405500000001,1437.9156,1466.0844,1361.6624999999999,1388.3375000000001,1263.1276499999999,1287.8723500000001,1060.1161500000001,1080.8838499999999,863.04644999999994,879.95355000000006,712.02569999999992,725.97430000000008,612.00540000000001,623.99459999999999,445.13984999999997,453.86015000000003,459.49919999999997,468.50080000000003,742,56,23017,1988,1963,9940,919]
[null,"02",5,5679,"CENTRO SALUD MANZANARES   ",13398,null,6634.0196999999989,6763.9803000000011,null,500.59664999999995,510.40335000000005,505.053,514.947,586.75274999999999,598.24725000000001,589.72365000000002,601.27634999999998,562.98554999999999,574.01445000000001,490.69364999999999,500.30635000000001,476.82944999999995,486.17055000000005,467.91674999999998,477.08325000000002,429.29505,437.70495,407.01329999999996,414.98670000000004,376.80914999999999,384.19085000000001,316.40084999999999,322.59915000000001,257.97314999999998,263.02685000000002,212.9145,217.0855,182.71035000000001,186.28964999999999,133.19534999999999,135.80465000000001,137.15654999999998,139.84345000000002,222,17,6875,594,586,2969,275]
[150802,null,6,150802,"DISTRITO AMBAR",2785,null,1378.9927500000001,1406.0072499999997,null,138.14685,140.85315,177.75885,181.24115,155.47710000000001,158.52289999999999,108.93299999999999,111.06700000000001,107.9427,110.0573,84.1755,85.8245,87.1464,88.8536,80.214299999999994,81.785700000000006,66.845249999999993,68.154750000000007,76.748249999999999,78.251750000000001,65.854950000000002,67.145049999999998,53.476199999999999,54.523800000000001,50.010149999999996,50.989850000000004,45.05865,45.94135,33.670200000000001,34.329799999999999,22.281749999999999,22.718250000000001,25.252649999999999,25.747350000000001,43,3,1299,141,103,483,53]
[null,"01",7,5680,"CENTRO SALUD AMBAR  ",1766,null,874.43489999999986,891.56510000000014,null,87.641549999999995,89.358450000000005,112.8942,115.1058,98.534849999999992,100.46515000000001,69.320999999999998,70.679000000000002,68.330699999999993,69.669300000000007,52.981049999999996,54.018950000000004,55.456800000000001,56.543199999999999,51.000450000000001,51.999549999999999,42.582899999999995,43.417100000000005,48.524699999999996,49.475300000000004,41.592599999999997,42.407400000000003,33.670200000000001,34.329799999999999,31.689599999999999,32.310400000000001,28.718699999999998,29.281300000000002,21.291449999999998,21.708550000000002,14.359349999999999,14.640650000000001,15.844799999999999,16.155200000000001,27,2,824,89,65,306,34]
[null,"01",8,5681,"PUESTO SALUD AYNACA   ",1019,null,504.55784999999997,514.44214999999997,null,50.505299999999998,51.494700000000002,64.864649999999997,66.135350000000003,56.942249999999994,58.057750000000006,39.611999999999995,40.388000000000005,39.611999999999995,40.388000000000005,31.19445,31.80555,31.689599999999999,32.310400000000001,29.213849999999997,29.786150000000003,24.262349999999998,24.737650000000002,28.223549999999999,28.776450000000001,24.262349999999998,24.737650000000002,19.805999999999997,20.194000000000003,18.320550000000001,18.679449999999999,16.339949999999998,16.660050000000002,12.37875,12.62125,7.9223999999999997,8.0776000000000003,9.4078499999999998,9.5921500000000002,16,1,475,52,38,177,19]
[150803,null,9,150803,"DISTRITO CARQUIN",6670,null,3302.6505000000002,3367.3494999999998,null,293.12880000000001,298.87119999999999,272.33249999999998,277.66750000000002,278.27429999999998,283.72570000000002,286.69184999999999,292.30815000000001,313.42994999999996,319.57005000000004,294.61424999999997,300.38575000000003,292.13849999999996,297.86150000000004,237.17685,241.82315,228.7593,233.2407,176.27339999999998,179.72660000000002,162.4092,165.5908,129.72929999999999,132.27070000000001,101.0106,102.9894,92.593049999999991,94.406950000000009,64.864649999999997,66.135350000000003,38.126550000000002,38.873449999999998,41.097449999999995,41.902550000000005,129,10,2896,254,279,1232,159]
[null,"02",10,5664,"CENTRO SALUD CARQUIN",6670,null,3302.6505000000002,3367.3494999999998,null,293.12880000000001,298.87119999999999,272.33249999999998,277.66750000000002,278.27429999999998,283.72570000000002,286.69184999999999,292.30815000000001,313.42994999999996,319.57005000000004,294.61424999999997,300.38575000000003,292.13849999999996,297.86150000000004,237.17685,241.82315,228.7593,233.2407,176.27339999999998,179.72660000000002,162.4092,165.5908,129.72929999999999,132.27070000000001,101.0106,102.9894,92.593049999999991,94.406950000000009,64.864649999999997,66.135350000000003,38.126550000000002,38.873449999999998,41.097449999999995,41.902550000000005,129,10,2896,254,279,1232,159]
[150804,null,11,150804,"DISTRUTO CHECRAS",1716,null,849.67740000000003,866.32259999999997,null,63.87435,65.125650000000007,67.340400000000002,68.659599999999998,81.204599999999999,82.795400000000001,52.981049999999996,54.018950000000004,33.670200000000001,34.329799999999999,43.078049999999998,43.921950000000002,40.107149999999997,40.892850000000003,57.437399999999997,58.562600000000003,52.981049999999996,54.018950000000004,50.505299999999998,51.494700000000002,63.87435,65.125650000000007,47.039249999999996,47.960750000000004,48.524699999999996,49.475300000000004,39.611999999999995,40.388000000000005,53.476199999999999,54.523800000000001,28.718699999999998,29.281300000000002,25.252649999999999,25.747350000000001,31,2,852,75,42,281,38]
[null,"05",12,5663,"PUESTO SALUD PUÑUN",1716,null,849.67740000000003,866.32259999999997,null,63.87435,65.125650000000007,67.340400000000002,68.659599999999998,81.204599999999999,82.795400000000001,52.981049999999996,54.018950000000004,33.670200000000001,34.329799999999999,43.078049999999998,43.921950000000002,40.107149999999997,40.892850000000003,57.437399999999997,58.562600000000003,52.981049999999996,54.018950000000004,50.505299999999998,51.494700000000002,63.87435,65.125650000000007,47.039249999999996,47.960750000000004,48.524699999999996,49.475300000000004,39.611999999999995,40.388000000000005,53.476199999999999,54.523800000000001,28.718699999999998,29.281300000000002,25.252649999999999,25.747350000000001,31,2,852,75,42,281,38]
[150805,null,13,150805,"DISTRITO HUALMAY",28380,null,14052.357,14327.643,null,1166.07825,1188.92175,1188.3599999999999,1211.6400000000001,1375.0315499999999,1401.9684500000001,1317.0989999999999,1342.9010000000001,1229.9525999999998,1254.0474000000002,1071.5046,1092.4954,1040.31015,1060.68985,1003.66905,1023.33095,906.61964999999998,924.38035000000002,762.53099999999995,777.46900000000005,683.30700000000002,696.69299999999998,610.51994999999999,622.48005000000001,487.72274999999996,497.27725000000004,412.95509999999996,421.04490000000004,309.96389999999997,316.03610000000003,237.17685,241.82315,249.5556,254.4444,517,39,14594,1377,1350,6268,641]
{"$rows_left_out":74}
{"sheet":"Pobla_EESS","index":2,"n_rows":59,"n_cols":16,"rows_kept":59,"cut":false,"hidden":false,"merged":[[50,4,52,4],[51,11,54,11],[54,3,54,5],[55,11,57,11],[58,10,58,12],[1,3,4,10],[7,3,7,8],[7,10,7,15],[15,3,15,4],[25,4,29,4],[25,11,30,11],[30,4,31,4],[23,3,23,8],[23,10,23,15],[31,10,31,12],[39,4,45,4],[39,11,41,11],[42,11,46,11],[46,4,49,4],[9,4,13,4],[9,11,11,11],[12,11,16,11],[16,3,16,5],[19,10,19,12],[32,3,32,5],[37,3,37,8],[37,10,37,15]]}
[]
[null,null,null,"POBLACIÓN SEGÚN DISTRITOS Y EE.SS - 2013"]
[]
[]
[]
[]
[]
[null,null,null,"SIN MICRORED",null,null,null,null,null,null,"MICRORED HUALMAY"]
[null,null,null,"DISTRITO","POBLACIÓN","EE.SS","POBLACIÓN","MASCULINO","FEMENINO",null,"DISTRITO","POBLACIÓN","EE.SS","POBLACIÓN","MASCULINO","FEMENINO"]
[null,null,null,"HUACHO",{"$f":"G10","v":44854},"HOSPITAL DOCENTE HUACHO  ",{"$f":"VLOOKUP($F10,Poblacion!$E$8:$I$87,2,FALSE)","v":44854},{"$f":"VLOOKUP($F10,Poblacion!$E$8:$I$87,4,FALSE)","v":22209.458099999996},{"$f":"VLOOKUP($F10,Poblacion!$E$8:$I$87,5,FALSE)","v":22644.541900000004},null,"HUALMAY",{"$f":"SUM(N10:N12)","v":28380},"CENTRO SALUD HUALMAY   ",{"$f":"VLOOKUP($M10,Poblacion!$E$8:$I$87,2,FALSE)","v":14190},{"$f":"VLOOKUP($M10,Poblacion!$E$8:$I$87,4,FALSE)","v":7026.1784999999991},{"$f":"VLOOKUP($M10,Poblacion!$E$8:$I$87,5,FALSE)","v":7163.8215000000009}]
[null,null,null,"HUACHO",null,"CLINICA SAN PEDRO",0,null,null,null,"HUALMAY",null,"PUESTO SALUD DGO.MANDAMIENTO  ",{"$f":"VLOOKUP($M11,Poblacion!$E$8:$I$87,2,FALSE)","v":9933},{"$f":"VLOOKUP($M11,Poblacion!$E$8:$I$87,4,FALSE)","v":4918.3249500000002},{"$f":"VLOOKUP($M11,Poblacion!$E$8:$I$87,5,FALSE)","v":5014.6750499999998}]
[null,null,null,"HUACHO",null,"ESSALUD GUSTAVO LA NATA",0,null,null,null,"HUALMAY",null,"PUESTO SALUD CAMPO ALEGRE   ",{"$f":"VLOOKUP($M12,Poblacion!$E$8:$I$87,2,FALSE)","v":4257},{"$f":"VLOOKUP($M12,Poblacion!$E$8:$I$87,4,FALSE)","v":2107.8535500000003},{"$f":"VLOOKUP($M12,Poblacion!$E$8:$I$87,5,FALSE)","v":2149.1464499999997}]
[null,null,null,"HUACHO",null,"CLINICA SAN BARTOLOME",0,null,null,null,"S.MARIA",{"$f":"SUM(N13:N17)","v":32174},"CENTRO SALUD SANTA MARIA",{"$f":"VLOOKUP($M13,Poblacion!$E$8:$I$87,2,FALSE)","v":9331},{"$f":"VLOOKUP($M13,Poblacion!$E$8:$I$87,4,FALSE)","v":4620.2446499999996},{"$f":"VLOOKUP($M13,Poblacion!$E$8:$I$87,5,FALSE)","v":4710.7553500000013}]
[null,null,null,"HUACHO",null,"GOLD ESTANDAR EIRL.",0,null,null,null,"S.MARIA",null,"PUESTO SALUD CHONTA",{"$f":"VLOOKUP($M14,Poblacion!$E$8:$I$87,2,FALSE)","v":4826},{"$f":"VLOOKUP($M14,Poblacion!$E$8:$I$87,4,FALSE)","v":2389.5938999999998},{"$f":"VLOOKUP($M14,Poblacion!$E$8:$I$87,5,FALSE)","v":2436.4061000000002}]
[null,null,null,"CARQUIN",null,"INSITUTO NACIONAL PENITENCIARIO CARQUIN",0,null,null,null,"S.MARIA",null,"PUESTO SALUD ZAPATA",{"$f":"VLOOKUP($M15,Poblacion!$E$8:$I$87,2,FALSE)","v":1930},{"$f":"VLOOKUP($M15,Poblacion!$E$8:$I$87,4,FALSE)","v":955.63949999999988},{"$f":"VLOOKUP($M15,Poblacion!$E$8:$I$87,5,FALSE)","v":974.36050000000012}]
[null,null,null,null,null,"OTROS ESTABLECIMIENTOS",0,null,null,null,"S.MARIA",null,"PUESTO SALUD AMADO VELASQUEZ",{"$f":"VLOOKUP($M16,Poblacion!$E$8:$I$87,2,FALSE)","v":8365},{"$f":"VLOOKUP($M16,Poblacion!$E$8:$I$87,4,FALSE)","v":4141.9297499999993},{"$f":"VLOOKUP($M16,Poblacion!$E$8:$I$87,5,FALSE)","v":4223.0702499999998}]
[null,null,null,"TOTAL SIN MICRORED",null,null,{"$f":"SUM(G10:G16)","v":44854},{"$f":"SUM(H10:H16)","v":22209.458099999996},{"$f":"SUM(I10:I16)","v":22644.541900000004},null,"S.MARIA",null,"PUESTO SALUD SAN BARTOLOME",{"$f":"VLOOKUP($M17,Poblacion!$E$8:$I$87,2,FALSE)","v":7722},{"$f":"VLOOKUP($M17,Poblacion!$E$8:$I$87,4,FALSE)","v":3823.548299999999},{"$f":"VLOOKUP($M17,Poblacion!$E$8:$I$87,5,FALSE)","v":3898.451700000001}]
[null,null,null,"=",null,null,null,null,null,null,"CARQUIN",{"$f":"SUM(N18)","v":6670},"CENTRO SALUD CARQUIN",{"$f":"VLOOKUP($M18,Poblacion!$E$8:$I$87,2,FALSE)","v":6670},{"$f":"VLOOKUP($M18,Poblacion!$E$8:$I$87,4,FALSE)","v":3302.6505000000002},{"$f":"VLOOKUP($M18,Poblacion!$E$8:$I$87,5,FALSE)","v":3367.3494999999998}]
[null,null,null,null,null,null,null,null,null,null,"HUACHO",{"$f":"SUM(N19)","v":13398},"CENTRO SALUD MANZANARES   ",{"$f":"VLOOKUP($M19,Poblacion!$E$8:$I$87,2,FALSE)","v":13398},{"$f":"VLOOKUP($M19,Poblacion!$E$8:$I$87,4,FALSE)","v":6634.0196999999989},{"$f":"VLOOKUP($M19,Poblacion!$E$8:$I$87,5,FALSE)","v":6763.9803000000011}]
[null,null,null,null,null,null,null,null,null,null,"TOTAL MCR HUALMAY",null,"TOTAL MICRORED HUALMAY",{"$f":"SUM(N10:N19)","v":80622},{"$f":"SUM(O10:O19)","v":39919.9833},{"$f":"SUM(P10:P19)","v":40702.016700000007}]
{"$rows_left_out":39}