{"text_format":"1","workbook":"xlsx","n_sheets":4,"sheets":["Interfaz","Poblacion","etapas y mredes","Pobla_EESS"],"not_rendered":{"charts":1,"images":13,"macros":1,"external_links":1,"defined_names":4,"comments":0,"pivot_tables":0},"unopened":[],"bounds":{"document_bytes":16777216,"sheet_cells":100000,"rows_first":2000,"rows_last":500,"rows_between":2000,"halvings":0,"cell_chars":16384,"cell_head_chars":4096},"cells_cut":0,"cells_raw":0,"read":"whole","date_system":"1900"}

{"sheet":"Interfaz","index":0,"n_rows":27,"n_cols":18,"rows_kept":27,"cut":false,"hidden":false,"merged":[[4,2,7,11],[9,2,11,11]]}
[]
[]
[]
[]
[null,null,"POBLACIÓN ASIGNADA SEGÚN CENSOS INEI - RENIEC - PN - CNV - 2012"]
[]
[]
[]
[]
[null,null,"RED INTEGRADA DE SALUD HUAURA OYÓN "]
[]
[]
[]
[]
[]
{"$rows_left_out":13}
{"sheet":"Poblacion","index":1,"n_rows":93,"n_cols":128,"rows_kept":93,"cut":false,"hidden":false,"merged":[[5,64,5,65],[5,48,5,49],[5,56,5,57],[5,66,5,67],[5,62,5,63],[5,46,5,47],[5,40,5,41],[4,42,4,43],[4,44,4,45],[5,42,5,43],[5,44,5,45],[5,24,5,25],[5,26,5,27],[4,16,4,17],[5,16,5,17],[4,38,4,39],[5,38,5,39],[4,5,6,5],[4,66,4,67],[5,12,5,13],[4,14,4,15],[5,14,5,15],[5,58,5,59],[5,36,5,37],[4,28,4,29],[5,32,5,33],[5,34,5,35],[5,28,5,29],[5,30,5,31],[5,54,5,55],[4,60,4,61],[5,60,5,61],[4,62,4,63],[4,7,6,7],[4,8,6,8],[5,50,5,51],[4,52,4,53],[5,52,5,53],[4,10,4,11],[5,10,5,11],[4,12,4,13],[4,18,4,19],[4,20,4,21],[4,22,4,23],[4,24,4,25],[4,26,4,27],[5,18,5,19],[5,20,5,21],[5,22,5,23],[4,79,4,82],[1,30,1,65],[2,30,2,65],[4,58,4,59],[4,48,4,49],[3,30,3,65],[4,36,4,37],[4,56,4,57],[4,30,4,31],[4,32,4,33],[4,34,4,35],[4,50,4,51],[4,54,4,55],[4,64,4,65],[4,40,4,41],[4,46,4,47],[4,74,4,75],[5,74,5,75],[4,76,6,76],[4,77,6,77],[4,78,6,78],[5,68,5,69],[5,70,5,71],[5,72,5,73],[4,72,4,73],[4,70,4,71],[4,68,4,69],[5,79,6,79],[5,80,6,80],[5,81,6,81],[5,82,6,82],[2,89,2,96],[4,94,6,94],[4,93,6,93],[4,87,6,87],[4,88,6,88],[4,89,6,89],[4,91,6,91],[4,90,6,90],[4,86,6,86],[4,95,6,95],[4,85,6,85],[4,84,6,84]]}
[null,null,1,2,3,4,5,6,7,8,9,10,11,12,13,14,15,16,17,18,19,20,21,22,23,24,25,26,27,28,29,30,31,32,33,34,35,36,37,38,39,40,41,42,43,44,45,46,47,48,49,50,51,52,53,54,55,56,57,58,59,60,61,62,63,64,65,66,67,68,69,70,71,72,73,74,75,76,77,78,79,80,81,82,83,84,85,86,87,88,89,90,91,92,93,94,null,null,null,77,78,79,80,81,82,83,84,85,86,87,88,89,90,91,92,93,94,95,96,97,98,99,106,107,108,109,110,111]
[null,null,null,null,null,null,null,null,null,null,null,null,null,null,null,null,null,null,null,null,null,null,null,null,null,null,null,null,null,null,"POBLACIÓN ESTIMADA POR GRUPOS DE EDAD, SEGÚN PROVINCIAS DISTRITOS Y ESTABLECIMIENTOS DE SALUD"]
[null,null,null,null,null,null,null,null,null,null,null,null,null,null,null,null,null,null,null,null,null,null,null,null,null,null,null,null,null,null,"RED INTEGRADA DE SALUD HUAURA OYON   -   AÑO  2012",null,null,null,null,null,null,null,null,null,null,null,null,null,null,null,null,null,null,null,null,null,null,null,null,null,null,null,null,null,null,null,null,null,null,null,null,null,null,null,null,null,null,null,null,null,null,null,null,null,null,null,null,null,null,null,null,null,null,"MAS GRUPOS DE EDAD"]
[null,null,null,null,null,null,null,null,null,null,null,null,null,null,null,null,null,null,null,null,null,null,null,null,null,null,null,null,null,null,"EDADES PUNTUALES Y GRUPOS DE EDAD"]
[null,null,"N°",null,"DIRECCION DE SALUD","TOTAL GENERAL",null,"TOTAL MASCULINO","TOTAL FEMENINO",null,"EDAD",null,"EDAD",null,"EDAD",null,"EDAD",null,"EDAD",null,"EDAD",null,"EDAD",null,"EDAD",null,"EDAD",null,"EDAD",null,"EDAD",null,"EDAD",null,"EDAD",null,"EDAD",null,"EDAD",null,"EDAD",null,"EDAD",null,"EDAD",null,"EDAD",null,"EDAD",null,"EDAD",null,"EDAD",null,"EDAD",null,"EDAD",null,"EDAD",null,"EDAD",null,"EDAD",null,"EDAD",null,"EDAD",null,"EDAD",null,"EDAD",null,"EDAD",null,"EDAD",null,"NACIMIENTOS","28 DIAS","POBLACION FEMENINA TOTAL","POBLACION FEMENINA",null,null,null,null,"menor de 1 Año","Pre escolar         (1-4)","Niño             (0 - 11)","Escolar               (05 - 17)","Adolescente (12 - 17)","Adulto Joven (18 - 29)","Adulto            (30-59)","Adu.Mayor (60 a MAS)",null,"Escolar               (05 - 09)","Adolescente (10 - 19)","Adulto            (20-59)"]
["UBIGEO",null,null,null,"PROVINCIA",null,null,null,null,null,0,null,1,null,2,null,3,null,4,null,5,null,6,null,7,null,8,null,9,null,10,null,11,null,12,null,13,null,14,null,15,null,16,null,17,null,18,null,19,null,"20 - 24",null,"25 - 29",null,"30 - 34",null,"35 - 39",null,"40 - 44 ",null,"45 - 49",null,"50 - 54 ",null,"55 - 59 ",null,"60 - 64",null,"65 - 69 ",null,"70- 74 ",null,"75 - 79 ",null,"80 - +",null,null,null,null,"10-14","15-19","20-49","GESTANTE"]
[null,"Microredes",null,"RENAES","DISTRITO",null,null,null,null,null,"M","F","M","F","M","F","M","F","M","F","M","F","M","F","M","F","M","F","M","F","M","F","M","F","M","F","M","F","M","F","M","F","M","F","M","F","M","F","M","F","M","F","M","F","M","F","M","F","M","F","M","F","M","F","M","F","M","F","M","F","M","F","M","F","M","F"]
[150000,null,1,null,"RED HUAURA - OYON",236587,null,117146.05305,119440.94695,null,2179.6502999999998,2222.3497000000002,2088.5427,2129.4573,2028.6295499999999,2068.3704499999999,1998.4253999999999,2037.5746000000001,1990.5029999999999,2029.4970000000001,2007.3380999999999,2046.6619000000001,2038.5325499999999,2078.4674500000001,2083.5911999999998,2124.4088000000002,2135.0868,2176.9132,2191.5338999999999,2234.4661000000001,2253.4276500000001,2297.5723499999999,2320.7680499999997,2366.2319500000003,2364.3412499999999,2410.6587500000001,2372.2636499999999,2418.7363500000001,2350.47705,2396.52295,2331.6613499999999,2377.3386500000001,2311.8553499999998,2357.1446500000002,2276.6997000000001,2321.3002999999999,2226.1943999999999,2269.8056000000001,2163.3103499999997,2205.6896500000003,9931.2235499999988,10125.776450000001,9075.6043499999996,9253.3956500000004,8745.3392999999996,8916.6607000000004,8043.2165999999997,8200.7834000000003,7164.8204999999998,7305.1795000000002,6581.5338000000002,6710.4661999999998,5485.76685,5593.23315,4717.2940499999995,4809.7059500000005,3869.1020999999996,3944.8979000000004,3217.4847,3280.5153,2763.9272999999998,2818.0727000000002,1939.5025499999999,1977.4974500000001,1898.4050999999999,1935.5949000000001,4437,337,117007,11434,11152,49482,5499,null,{"$f":"SUM(K8:L8)","v":4402},{"$f":"SUM(M8:T8)","v":16371},{"$f":"SUM(K8:AH8)","v":51128},{"$f":"SUM(U8:AT8)","v":58644},{"$f":"SUM(AI8:AT8)","v":28289},{"$f":"SUM(AU8:BB8)","v":47251},{"$f":"SUM(BC8:BN8)","v":82274},{"$f":"SUM(BO8:BX8)","v":27645},null,{"$f":"SUM(U8:AD8)","v":21117},{"$f":"SUM(AE8:AX8)","v":46392},{"$f":"SUM(AY8:BN8)","v":120660}]
[150800,null,2,150800,"PROVINCIA HUAURA",213188,null,105560.03819999998,107627.9618,null,1922.1723,1959.8277,1838.4919499999999,1874.5080500000001,1785.01575,1819.98425,1756.7921999999999,1791.2078000000001,1750.8504,1785.1496,1765.20975,1799.79025,1794.4235999999999,1829.5764000000001,1835.5210499999998,1871.4789500000002,1885.0360499999999,1921.9639500000001,1939.0074,1976.9926,1996.93995,2036.06005,2059.8240000000001,2100.1759999999999,2105.3777999999998,2146.6222000000002,2122.2129,2163.7871,2115.2808,2156.7192,2111.3195999999998,2152.6804000000002,2105.3777999999998,2146.6222000000002,2083.0960500000001,2123.9039499999999,2039.5228499999998,2079.4771500000002,1982.5806,2021.4194,9078.5752499999999,9256.4247500000001,8175.4216499999993,8335.5783499999998,7872.3898499999996,8026.6101500000004,7187.5973999999997,7328.4026000000003,6512.70795,6640.29205,5960.6156999999994,6077.3843000000006,5018.3452499999994,5116.6547500000006,4323.6498000000001,4408.3501999999999,3558.1478999999999,3627.8521000000001,2901.08385,2957.91615,2501.9929499999998,2551.0070500000002,1734.0153,1767.9847,1741.44255,1775.55745,3909,298,106064,10217,10192,45275,4845,null,3882,14402,45096,52345,25533,42969,74473,25117,null,18619,41849,109319]
[150801,null,3,150802,"DISTRITO HUACHO",58105,null,28770.690750000002,29334.309249999998,null,478.81004999999999,488.18995000000001,451.57679999999999,460.42320000000001,433.75139999999999,442.24860000000001,423.35325,431.64675,420.38234999999997,428.61765000000003,423.35325,431.64675,431.27564999999998,439.72435000000002,442.66409999999996,451.33590000000004,457.02344999999997,465.97655000000003,472.37309999999997,481.62690000000003,490.19849999999997,499.80150000000003,510.00449999999995,519.99549999999999,524.36384999999996,534.63615000000004,530.30565000000001,540.69434999999999,529.81049999999993,540.18950000000007,530.30565000000001,540.69434999999999,529.81049999999993,540.18950000000007,526.34444999999994,536.65555000000006,519.90750000000003,530.09249999999997,510.49964999999997,520.50035000000003,2400.9823499999998,2448.0176500000002,2170.2424499999997,2212.7575500000003,2101.9117499999998,2143.0882500000002,1990.00785,2028.99215,1873.1524499999998,1909.8475500000002,1764.2194499999998,1798.7805500000002,1591.4121,1622.5879,1348.2934499999999,1374.7065500000001,1085.8639499999999,1107.1360500000001,899.68754999999999,917.31245000000001,778.37579999999991,793.62420000000009,561.99524999999994,573.00475000000006,568.43219999999997,579.56780000000003,973,74,29821,2621,2607,12887,1207,null,967,3492,10976,12921,6404,11313,21547,7865,null,4497,10505,30779]
[null,"00",4,7639,"HOSPITAL DOCENTE HUACHO  ",45319,null,22439.702849999998,22879.297150000002,null,373.34309999999999,380.65690000000001,352.05165,358.94835,338.18745000000001,344.81254999999999,330.26504999999997,336.73495000000003,327.78929999999997,334.21070000000003,330.26504999999997,336.73495000000003,336.20684999999997,342.79315000000003,345.11955,351.88045,356.50799999999998,363.49200000000002,368.39159999999998,375.60840000000002,382.25579999999997,389.74420000000003,397.60544999999996,405.39455000000004,408.9939,417.0061,413.45024999999998,421.54975000000002,413.45024999999998,421.54975000000002,413.45024999999998,421.54975000000002,413.45024999999998,421.54975000000002,410.47935000000001,418.52064999999999,405.52785,413.47215,398.10059999999999,405.89940000000001,1872.6572999999999,1909.3427000000001,1692.9178499999998,1726.0821500000002,1639.44165,1671.55835,1552.2952499999999,1582.7047500000001,1461.1876499999998,1489.8123500000002,1376.0218499999999,1402.9781500000001,1241.34105,1265.65895,1051.6985999999999,1072.3014000000001,847.20164999999997,863.79835000000003,701.62754999999993,715.37245000000007,607.0539,618.9461,438.20774999999998,446.79225000000002,443.15924999999999,451.84075000000001,759,58,23260,2044,2033,10052,941,null,754,2723,8559,10077,4995,8824,16807,6134,null,3507,8193,24008]
[null,"02",5,5679,"CENTRO SALUD MANZANARES   ",12786,null,6330.9878999999992,6455.0121000000008,null,105.46695,107.53305,99.525149999999996,101.47485,95.563949999999991,97.436050000000009,93.088200000000001,94.911799999999999,92.593049999999991,94.406950000000009,93.088200000000001,94.911799999999999,95.068799999999996,96.931200000000004,97.544550000000001,99.455449999999999,100.51545,102.48455,103.9815,106.0185,107.9427,110.0573,112.39904999999999,114.60095000000001,115.36994999999999,117.63005000000001,116.85539999999999,119.14460000000001,116.36024999999999,118.63975000000001,116.85539999999999,119.14460000000001,116.36024999999999,118.63975000000001,115.8651,118.1349,114.37965,116.62035,112.39904999999999,114.60095000000001,528.32505000000003,538.67494999999997,477.32459999999998,486.67540000000002,462.4701,471.5299,437.71260000000001,446.28739999999999,411.96479999999997,420.03520000000003,388.19759999999997,395.80240000000003,350.07104999999996,356.92895000000004,296.59485000000001,302.40514999999999,238.66229999999999,243.33770000000001,198.06,201.94,171.3219,174.6781,123.78749999999999,126.21250000000001,125.27294999999999,127.72705000000001,214,16,6561,577,574,2835,266,null,213,769,2417,2844,1409,2489,4740,1731,null,990,2312,6771]
[150802,null,6,150802,"DISTRITO AMBAR",2809,null,1390.8763499999998,1418.12365,null,20.796299999999999,21.203700000000001,25.252649999999999,25.747350000000001,29.213849999999997,29.786150000000003,32.184750000000001,32.815249999999999,34.165349999999997,34.834650000000003,35.650799999999997,36.349200000000003,36.641100000000002,37.358899999999998,36.641100000000002,37.358899999999998,36.641100000000002,37.358899999999998,36.145949999999999,36.854050000000001,35.155650000000001,35.844349999999999,33.670200000000001,34.329799999999999,32.184750000000001,32.815249999999999,30.204149999999998,30.795850000000002,27.728400000000001,28.271599999999999,25.747799999999998,26.252200000000002,23.27205,23.72795,21.291449999999998,21.708550000000002,20.796299999999999,21.203700000000001,21.291449999999998,21.708550000000002,106.9524,109.0476,86.156099999999995,87.843900000000005,89.126999999999995,90.873000000000005,79.22399999999999,80.77600000000001,67.835549999999998,69.164450000000002,77.243399999999994,78.756600000000006,64.369500000000002,65.630499999999998,52.981049999999996,54.018950000000004,49.019849999999998,49.980150000000002,44.068349999999995,44.931650000000005,33.175049999999999,33.824950000000001,21.7866,22.2134,24.262349999999998,24.737650000000002,43,3,1310,144,106,486,53,null,42,244,792,830,324,475,870,348,null,367,548,1260]
[null,"01",7,5680,"CENTRO SALUD AMBAR  ",1683,null,833.33744999999999,849.66255000000001,null,12.37875,12.62125,15.349649999999999,15.650350000000001,17.330249999999999,17.669750000000001,19.310849999999999,19.689150000000001,20.30115,20.69885,21.291449999999998,21.708550000000002,21.7866,22.2134,21.7866,22.2134,21.7866,22.2134,21.7866,22.2134,21.291449999999998,21.708550000000002,20.30115,20.69885,19.310849999999999,19.689150000000001,18.320550000000001,18.679449999999999,16.835100000000001,17.164899999999999,15.349649999999999,15.650350000000001,13.8642,14.1358,12.873899999999999,13.126100000000001,12.37875,12.62125,12.873899999999999,13.126100000000001,64.369500000000002,65.630499999999998,51.495599999999996,52.504400000000004,53.476199999999999,54.523800000000001,47.534399999999998,48.465600000000002,40.6023,41.3977,46.5441,47.4559,38.621699999999997,39.378300000000003,31.689599999999999,32.310400000000001,29.213849999999997,29.786150000000003,26.24295,26.75705,19.805999999999997,20.194000000000003,12.873899999999999,13.126100000000001,14.359349999999999,14.640650000000001,26,2,786,86,64,292,32,null,25,146,474,498,195,285,522,207,null,219,330,756]
[null,"01",8,5681,"PUESTO SALUD AYNACA   ",1126,null,557.5388999999999,568.4611000000001,null,8.4175500000000003,8.5824499999999997,9.9029999999999987,10.097000000000001,11.883599999999999,12.116400000000001,12.873899999999999,13.126100000000001,13.8642,14.1358,14.359349999999999,14.640650000000001,14.8545,15.1455,14.8545,15.1455,14.8545,15.1455,14.359349999999999,14.640650000000001,13.8642,14.1358,13.36905,13.63095,12.873899999999999,13.126100000000001,11.883599999999999,12.116400000000001,10.8933,11.1067,10.398149999999999,10.601850000000001,9.4078499999999998,9.5921500000000002,8.4175500000000003,8.5824499999999997,8.4175500000000003,8.5824499999999997,8.4175500000000003,8.5824499999999997,42.582899999999995,43.417100000000005,34.660499999999999,35.339500000000001,35.650799999999997,36.349200000000003,31.689599999999999,32.310400000000001,27.233249999999998,27.766750000000002,30.699299999999997,31.300700000000003,25.747799999999998,26.252200000000002,21.291449999999998,21.708550000000002,19.805999999999997,20.194000000000003,17.825399999999998,18.174600000000002,13.36905,13.63095,8.9126999999999992,9.0873000000000008,9.9029999999999987,10.097000000000001,17,1,524,58,42,194,21,null,17,98,318,332,129,190,348,141,null,148,218,504]
{"$rows_left_out":79}
{"sheet":"etapas y mredes","index":2,"n_rows":38,"n_cols":21,"rows_kept":38,"cut":false,"hidden":false,"merged":[[6,15,6,20],[6,2,6,11],[1,2,5,12],[36,2,36,3],[35,2,35,3],[34,2,34,3],[33,2,33,3],[32,2,32,3],[31,2,31,3],[30,2,30,3],[29,2,29,3],[28,2,28,3],[27,2,27,3],[26,2,26,3],[25,2,25,3],[36,4,36,5],[35,4,35,5],[34,4,34,5],[33,4,33,5],[32,4,32,5],[31,4,31,5],[25,4,25,5],[30,4,30,5],[29,4,29,5],[28,4,28,5],[27,4,27,5],[26,4,26,5]]}
[]
[null,null,"POBLACION ASIGNADA POR DISTRITO SIERRA, HOSPITAL, MICROREDES Y POR ETAPAS DE VIDA 2020"]
[]
[]
[]
[]
[null,null,"DISTRITO",null,null,null,null,null,null,null,null,null,null,null,null,"MICROREDES"]
[null,null,65,67,11,74,60,28,76,33,null,null,null,4,null,82,83,84,85,86]
[null,"POBLACION POR\nETAPAS DE VIDA","Andajes","Caujul","Checras","Naván","Oyón","Paccho","Pachangara","Santa Leonor","TOTAL","PORC. (%)",null,"HOSPITAL HUACHO",null,"HUAURA","HUALMAY","SAYAN","VEGUETA","CHURIN OYON","Total Microredes"]
[76,"Neonatal (0-28dias)",{"$f":"VLOOKUP(C$8,Poblacion!$C$8:$CR$93,$A10)","v":0},{"$f":"VLOOKUP(D$8,Poblacion!$C$8:$CR$93,$A10)","v":1},{"$f":"VLOOKUP(E$8,Poblacion!$C$8:$CR$93,$A10)","v":2},{"$f":"VLOOKUP(F$8,Poblacion!$C$8:$CR$93,$A10)","v":3},{"$f":"VLOOKUP(G$8,Poblacion!$C$8:$CR$93,$A10)","v":22},{"$f":"VLOOKUP(H$8,Poblacion!$C$8:$CR$93,$A10)","v":2},{"$f":"VLOOKUP(I$8,Poblacion!$C$8:$CR$93,$A10)","v":4},{"$f":"VLOOKUP(J$8,Poblacion!$C$8:$CR$93,$A10)","v":2},{"$f":"SUM(C10:J10)","v":36},{"$f":"IFERROR((K10/$K$20)*100,0)","v":0.15693796590958631},null,{"$f":"VLOOKUP(N$8,Poblacion!$C$8:$CR$93,$A10)","v":58},null,{"$f":"VLOOKUP(P$8,Poblacion!$C$8:$CR$93,$A10)","v":52},{"$f":"VLOOKUP(Q$8,Poblacion!$C$8:$CR$93,$A10)","v":110},{"$f":"VLOOKUP(R$8,Poblacion!$C$8:$CR$93,$A10)","v":40},{"$f":"VLOOKUP(S$8,Poblacion!$C$8:$CR$93,$A10)","v":35},{"$f":"VLOOKUP(T$8,Poblacion!$C$8:$CR$93,$A10)","v":40},{"$f":"SUM(P10:T10)","v":277}]
[83,"Infantil (Men.1año)",{"$f":"VLOOKUP(C$8,Poblacion!$C$8:$CR$93,$A11)","v":6},{"$f":"VLOOKUP(D$8,Poblacion!$C$8:$CR$93,$A11)","v":15},{"$f":"VLOOKUP(E$8,Poblacion!$C$8:$CR$93,$A11)","v":29},{"$f":"VLOOKUP(F$8,Poblacion!$C$8:$CR$93,$A11)","v":38},{"$f":"VLOOKUP(G$8,Poblacion!$C$8:$CR$93,$A11)","v":279},{"$f":"VLOOKUP(H$8,Poblacion!$C$8:$CR$93,$A11)","v":32},{"$f":"VLOOKUP(I$8,Poblacion!$C$8:$CR$93,$A11)","v":62},{"$f":"VLOOKUP(J$8,Poblacion!$C$8:$CR$93,$A11)","v":23},{"$f":"SUM(C11:J11)","v":484},{"$f":"IFERROR((K11/$K$20)*100,0)","v":2.1099437638955489},null,{"$f":"VLOOKUP(N$8,Poblacion!$C$8:$CR$93,$A11)","v":754},null,{"$f":"VLOOKUP(P$8,Poblacion!$C$8:$CR$93,$A11)","v":679},{"$f":"VLOOKUP(Q$8,Poblacion!$C$8:$CR$93,$A11)","v":1427},{"$f":"VLOOKUP(R$8,Poblacion!$C$8:$CR$93,$A11)","v":529},{"$f":"VLOOKUP(S$8,Poblacion!$C$8:$CR$93,$A11)","v":457},{"$f":"VLOOKUP(T$8,Poblacion!$C$8:$CR$93,$A11)","v":527},{"$f":"SUM(P11:T11)","v":3619}]
[84,"Pre-escolar (01-04años)",{"$f":"VLOOKUP(C$8,Poblacion!$C$8:$CR$93,$A12)","v":37},{"$f":"VLOOKUP(D$8,Poblacion!$C$8:$CR$93,$A12)","v":84},{"$f":"VLOOKUP(E$8,Poblacion!$C$8:$CR$93,$A12)","v":99},{"$f":"VLOOKUP(F$8,Poblacion!$C$8:$CR$93,$A12)","v":101},{"$f":"VLOOKUP(G$8,Poblacion!$C$8:$CR$93,$A12)","v":1041},{"$f":"VLOOKUP(H$8,Poblacion!$C$8:$CR$93,$A12)","v":133},{"$f":"VLOOKUP(I$8,Poblacion!$C$8:$CR$93,$A12)","v":205},{"$f":"VLOOKUP(J$8,Poblacion!$C$8:$CR$93,$A12)","v":90},1790,7.8033044160599845,null,{"$f":"VLOOKUP(N$8,Poblacion!$C$8:$CR$93,$A12)","v":2723},null,{"$f":"VLOOKUP(P$8,Poblacion!$C$8:$CR$93,$A12)","v":2595},{"$f":"VLOOKUP(Q$8,Poblacion!$C$8:$CR$93,$A12)","v":5258},{"$f":"VLOOKUP(R$8,Poblacion!$C$8:$CR$93,$A12)","v":2196},{"$f":"VLOOKUP(S$8,Poblacion!$C$8:$CR$93,$A12)","v":1545},{"$f":"VLOOKUP(T$8,Poblacion!$C$8:$CR$93,$A12)","v":1955},13549]
[85,"Niño (0-11años)",{"$f":"VLOOKUP(C$8,Poblacion!$C$8:$CR$93,$A13)","v":134},{"$f":"VLOOKUP(D$8,Poblacion!$C$8:$CR$93,$A13)","v":249},{"$f":"VLOOKUP(E$8,Poblacion!$C$8:$CR$93,$A13)","v":330},{"$f":"VLOOKUP(F$8,Poblacion!$C$8:$CR$93,$A13)","v":270},{"$f":"VLOOKUP(G$8,Poblacion!$C$8:$CR$93,$A13)","v":3183},{"$f":"VLOOKUP(H$8,Poblacion!$C$8:$CR$93,$A13)","v":439},{"$f":"VLOOKUP(I$8,Poblacion!$C$8:$CR$93,$A13)","v":638},{"$f":"VLOOKUP(J$8,Poblacion!$C$8:$CR$93,$A13)","v":336},5579,24.321025328043945,null,{"$f":"VLOOKUP(N$8,Poblacion!$C$8:$CR$93,$A13)","v":8559},null,{"$f":"VLOOKUP(P$8,Poblacion!$C$8:$CR$93,$A13)","v":8284},{"$f":"VLOOKUP(Q$8,Poblacion!$C$8:$CR$93,$A13)","v":16500},{"$f":"VLOOKUP(R$8,Poblacion!$C$8:$CR$93,$A13)","v":6746},{"$f":"VLOOKUP(S$8,Poblacion!$C$8:$CR$93,$A13)","v":4648},{"$f":"VLOOKUP(T$8,Poblacion!$C$8:$CR$93,$A13)","v":6061},42239]
[86,"Escolar  (05-17años)",{"$f":"VLOOKUP(C$8,Poblacion!$C$8:$CR$93,$A14)","v":176},{"$f":"VLOOKUP(D$8,Poblacion!$C$8:$CR$93,$A14)","v":249},{"$f":"VLOOKUP(E$8,Poblacion!$C$8:$CR$93,$A14)","v":372},{"$f":"VLOOKUP(F$8,Poblacion!$C$8:$CR$93,$A14)","v":231},{"$f":"VLOOKUP(G$8,Poblacion!$C$8:$CR$93,$A14)","v":3306},{"$f":"VLOOKUP(H$8,Poblacion!$C$8:$CR$93,$A14)","v":470},{"$f":"VLOOKUP(I$8,Poblacion!$C$8:$CR$93,$A14)","v":701},{"$f":"VLOOKUP(J$8,Poblacion!$C$8:$CR$93,$A14)","v":408},5913,25.777060900649552,null,{"$f":"VLOOKUP(N$8,Poblacion!$C$8:$CR$93,$A14)","v":10077},null,{"$f":"VLOOKUP(P$8,Poblacion!$C$8:$CR$93,$A14)","v":9978},{"$f":"VLOOKUP(Q$8,Poblacion!$C$8:$CR$93,$A14)","v":19102},{"$f":"VLOOKUP(R$8,Poblacion!$C$8:$CR$93,$A14)","v":7457},{"$f":"VLOOKUP(S$8,Poblacion!$C$8:$CR$93,$A14)","v":5264},{"$f":"VLOOKUP(T$8,Poblacion!$C$8:$CR$93,$A14)","v":6394},48195]
[87,"Adolescente (12-17años)",{"$f":"VLOOKUP(C$8,Poblacion!$C$8:$CR$93,$A15)","v":85},{"$f":"VLOOKUP(D$8,Poblacion!$C$8:$CR$93,$A15)","v":99},{"$f":"VLOOKUP(E$8,Poblacion!$C$8:$CR$93,$A15)","v":170},{"$f":"VLOOKUP(F$8,Poblacion!$C$8:$CR$93,$A15)","v":100},{"$f":"VLOOKUP(G$8,Poblacion!$C$8:$CR$93,$A15)","v":1443},{"$f":"VLOOKUP(H$8,Poblacion!$C$8:$CR$93,$A15)","v":196},{"$f":"VLOOKUP(I$8,Poblacion!$C$8:$CR$93,$A15)","v":330},{"$f":"VLOOKUP(J$8,Poblacion!$C$8:$CR$93,$A15)","v":185},2608,11.36928375256114,null,{"$f":"VLOOKUP(N$8,Poblacion!$C$8:$CR$93,$A15)","v":4995},null,{"$f":"VLOOKUP(P$8,Poblacion!$C$8:$CR$93,$A15)","v":4968},{"$f":"VLOOKUP(Q$8,Poblacion!$C$8:$CR$93,$A15)","v":9287},{"$f":"VLOOKUP(R$8,Poblacion!$C$8:$CR$93,$A15)","v":3436},{"$f":"VLOOKUP(S$8,Poblacion!$C$8:$CR$93,$A15)","v":2618},{"$f":"VLOOKUP(T$8,Poblacion!$C$8:$CR$93,$A15)","v":2815},23124]
{"$rows_left_out":24}
{"sheet":"Pobla_EESS","index":3,"n_rows":60,"n_cols":16,"rows_kept":60,"cut":false,"hidden":false,"merged":[[50,4,52,4],[51,11,54,11],[54,3,54,5],[55,11,57,11],[58,10,58,12],[1,3,4,10],[7,3,7,8],[7,10,7,15],[15,3,15,4],[25,4,29,4],[25,11,30,11],[30,4,31,4],[23,3,23,8],[23,10,23,15],[31,10,31,12],[39,4,45,4],[39,11,41,11],[42,11,46,11],[46,4,49,4],[9,4,13,4],[9,11,11,11],[12,11,16,11],[16,3,16,5],[19,10,19,12],[32,3,32,5],[37,3,37,8],[37,10,37,15]]}
[]
[null,null,null,"POBLACIÓN SEGÚN DISTRITOS Y EE.SS - 2012"]
[]
[]
[]
[]
[]
[null,null,null,"SIN MICRORED",null,null,null,null,null,null,"MICRORED HUALMAY"]
[null,null,null,"DISTRITO","POBLACIÓN","EE.SS","POBLACIÓN","MASCULINO","FEMENINO",null,"DISTRITO","POBLACIÓN","EE.SS","POBLACIÓN","MASCULINO","FEMENINO"]
[null,null,null,"HUACHO",{"$f":"G10","v":45319},"HOSPITAL DOCENTE HUACHO  ",{"$f":"VLOOKUP($F10,Poblacion!$E$8:$I$87,2,FALSE)","v":45319},{"$f":"VLOOKUP($F10,Poblacion!$E$8:$I$87,4,FALSE)","v":22439.702849999998},{"$f":"VLOOKUP($F10,Poblacion!$E$8:$I$87,5,FALSE)","v":22879.297150000002},null,"HUALMAY",{"$f":"SUM(N10:N12)","v":28270},"CENTRO SALUD HUALMAY   ",{"$f":"VLOOKUP($M10,Poblacion!$E$8:$I$87,2,FALSE)","v":14901},{"$f":"VLOOKUP($M10,Poblacion!$E$8:$I$87,4,FALSE)","v":7378.2301500000003},{"$f":"VLOOKUP($M10,Poblacion!$E$8:$I$87,5,FALSE)","v":7522.7698499999997}]
[null,null,null,"HUACHO",null,"CLINICA SAN PEDRO",0,null,null,null,"HUALMAY",null,"PUESTO SALUD DGO.MANDAMIENTO  ",{"$f":"VLOOKUP($M11,Poblacion!$E$8:$I$87,2,FALSE)","v":9335},{"$f":"VLOOKUP($M11,Poblacion!$E$8:$I$87,4,FALSE)","v":4622.2252499999995},{"$f":"VLOOKUP($M11,Poblacion!$E$8:$I$87,5,FALSE)","v":4712.7747500000005}]
[null,null,null,"HUACHO",null,"ESSALUD GUSTAVO LA NATA",0,null,null,null,"HUALMAY",null,"PUESTO SALUD CAMPO ALEGRE   ",{"$f":"VLOOKUP($M12,Poblacion!$E$8:$I$87,2,FALSE)","v":4034},{"$f":"VLOOKUP($M12,Poblacion!$E$8:$I$87,4,FALSE)","v":1997.4351000000001},{"$f":"VLOOKUP($M12,Poblacion!$E$8:$I$87,5,FALSE)","v":2036.5648999999999}]
[null,null,null,"HUACHO",null,"CLINICA SAN BARTOLOME",0,null,null,null,"S.MARIA",{"$f":"SUM(N13:N17)","v":31528},"CENTRO SALUD SANTA MARIA",{"$f":"VLOOKUP($M13,Poblacion!$E$8:$I$87,2,FALSE)","v":8813},{"$f":"VLOOKUP($M13,Poblacion!$E$8:$I$87,4,FALSE)","v":4363.75695},{"$f":"VLOOKUP($M13,Poblacion!$E$8:$I$87,5,FALSE)","v":4449.24305}]
[null,null,null,"HUACHO",null,"GOLD ESTANDAR EIRL.",0,null,null,null,"S.MARIA",null,"PUESTO SALUD CHONTA",{"$f":"VLOOKUP($M14,Poblacion!$E$8:$I$87,2,FALSE)","v":4733},{"$f":"VLOOKUP($M14,Poblacion!$E$8:$I$87,4,FALSE)","v":2343.54495},{"$f":"VLOOKUP($M14,Poblacion!$E$8:$I$87,5,FALSE)","v":2389.45505}]
[null,null,null,"CARQUIN",null,"INSITUTO NACIONAL PENITENCIARIO CARQUIN",0,null,null,null,"S.MARIA",null,"PUESTO SALUD ZAPATA",{"$f":"VLOOKUP($M15,Poblacion!$E$8:$I$87,2,FALSE)","v":2528},{"$f":"VLOOKUP($M15,Poblacion!$E$8:$I$87,4,FALSE)","v":1251.7392},{"$f":"VLOOKUP($M15,Poblacion!$E$8:$I$87,5,FALSE)","v":1276.2608}]
{"$rows_left_out":45}