{"text_format":"1","workbook":"xlsx","n_sheets":4,"sheets":["Interfaz","Poblacion","etapas y mredes","Pobla_EESS"],"not_rendered":{"charts":1,"images":13,"macros":1,"external_links":1,"defined_names":4,"comments":0,"pivot_tables":0},"unopened":[],"bounds":{"document_bytes":16777216,"sheet_cells":100000,"rows_first":2000,"rows_last":500,"rows_between":2000,"halvings":0,"cell_chars":16384,"cell_head_chars":4096},"cells_cut":0,"cells_raw":0,"read":"whole","date_system":"1900"}

{"sheet":"Interfaz","index":0,"n_rows":27,"n_cols":18,"rows_kept":27,"cut":false,"hidden":false,"merged":[[4,2,7,11],[9,2,11,11]]}
[]
[]
[]
[]
[null,null,"POBLACIÓN ASIGNADA SEGÚN CENSOS INEI - RENIEC - PN - CNV - 2011"]
[]
[]
[]
[]
[null,null,"RED INTEGRADA DE SALUD HUAURA OYÓN "]
[]
[]
[]
[]
[]
[]
[]
[]
[]
[]
{"$rows_left_out":8}
{"sheet":"Poblacion","index":1,"n_rows":93,"n_cols":127,"rows_kept":93,"cut":false,"hidden":false,"merged":[[5,46,5,47],[4,76,6,76],[4,77,6,77],[5,40,5,41],[4,42,4,43],[4,44,4,45],[5,42,5,43],[5,44,5,45],[5,64,5,65],[5,48,5,49],[5,56,5,57],[5,66,5,67],[5,62,5,63],[4,74,4,75],[5,74,5,75],[5,24,5,25],[5,26,5,27],[4,16,4,17],[5,16,5,17],[4,38,4,39],[5,38,5,39],[4,5,6,5],[4,66,4,67],[5,12,5,13],[4,14,4,15],[5,14,5,15],[5,58,5,59],[5,36,5,37],[4,28,4,29],[5,32,5,33],[5,34,5,35],[5,28,5,29],[5,30,5,31],[5,54,5,55],[4,60,4,61],[5,60,5,61],[4,62,4,63],[4,7,6,7],[4,8,6,8],[5,50,5,51],[4,52,4,53],[5,52,5,53],[4,10,4,11],[5,10,5,11],[4,12,4,13],[4,18,4,19],[4,20,4,21],[4,22,4,23],[4,24,4,25],[4,26,4,27],[5,18,5,19],[5,20,5,21],[5,22,5,23],[1,30,1,65],[2,30,2,65],[4,58,4,59],[4,48,4,49],[3,30,3,65],[4,36,4,37],[4,56,4,57],[4,30,4,31],[4,32,4,33],[4,34,4,35],[4,50,4,51],[4,54,4,55],[4,64,4,65],[4,40,4,41],[4,46,4,47],[5,81,6,81],[5,68,5,69],[5,70,5,71],[5,72,5,73],[4,72,4,73],[4,70,4,71],[4,68,4,69],[4,84,6,84],[4,78,4,81],[5,79,6,79],[5,80,6,80],[2,88,2,95],[4,93,6,93],[4,92,6,92],[4,86,6,86],[4,87,6,87],[4,88,6,88],[4,90,6,90],[4,89,6,89],[4,83,6,83],[4,85,6,85],[4,94,6,94],[5,78,6,78]]}
[null,null,1,2,3,4,5,6,7,8,9,10,11,12,13,14,15,16,17,18,19,20,21,22,23,24,25,26,27,28,29,30,31,32,33,34,35,36,37,38,39,40,41,42,43,44,45,46,47,48,49,50,51,52,53,54,55,56,57,58,59,60,61,62,63,64,65,66,67,68,69,70,71,72,73,74,75,76,77,78,79,80,81,82,83,84,85,86,87,88,89,90,91,92,93,null,null,null,77,78,79,80,81,82,83,84,85,86,87,88,89,90,91,92,93,94,95,96,97,98,99,106,107,108,109,110,111]
[null,null,null,null,null,null,null,null,null,null,null,null,null,null,null,null,null,null,null,null,null,null,null,null,null,null,null,null,null,null,"POBLACIÓN ESTIMADA POR GRUPOS DE EDAD, SEGÚN PROVINCIAS DISTRITOS Y ESTABLECIMIENTOS DE SALUD"]
[null,null,null,null,null,null,null,null,null,null,null,null,null,null,null,null,null,null,null,null,null,null,null,null,null,null,null,null,null,null,"RED INTEGRADA DE SALUD HUAURA OYON   -   AÑO  2011",null,null,null,null,null,null,null,null,null,null,null,null,null,null,null,null,null,null,null,null,null,null,null,null,null,null,null,null,null,null,null,null,null,null,null,null,null,null,null,null,null,null,null,null,null,null,null,null,null,null,null,null,null,null,null,null,null,"MAS GRUPOS DE EDAD"]
[null,null,null,null,null,null,null,null,null,null,null,null,null,null,null,null,null,null,null,null,null,null,null,null,null,null,null,null,null,null,"EDADES PUNTUALES Y GRUPOS DE EDAD"]
[null,null,"N°",null,"DIRECCION DE SALUD","TOTAL GENERAL",null,"TOTAL MASCULINO","TOTAL FEMENINO",null,"EDAD",null,"EDAD",null,"EDAD",null,"EDAD",null,"EDAD",null,"EDAD",null,"EDAD",null,"EDAD",null,"EDAD",null,"EDAD",null,"EDAD",null,"EDAD",null,"EDAD",null,"EDAD",null,"EDAD",null,"EDAD",null,"EDAD",null,"EDAD",null,"EDAD",null,"EDAD",null,"EDAD",null,"EDAD",null,"EDAD",null,"EDAD",null,"EDAD",null,"EDAD",null,"EDAD",null,"EDAD",null,"EDAD",null,"EDAD",null,"EDAD",null,"EDAD",null,"EDAD",null,"NACIMIENTOS","28 DIAS","POBLACION FEMENINA",null,null,null,null,"menor de 1 Año","Pre escolar         (1-4)","Niño             (0 - 11)","Escolar               (05 - 17)","Adolescente (12 - 17)","Adulto Joven (18 - 29)","Adulto            (30-59)","Adu.Mayor (60 a MAS)",null,"Escolar               (05 - 09)","Adolescente (10 - 19)","Adulto            (20-59)"]
["UBIGEO",null,null,null,"PROVINCIA",null,null,null,null,null,0,null,1,null,2,null,3,null,4,null,5,null,6,null,7,null,8,null,9,null,10,null,11,null,12,null,13,null,14,null,15,null,16,null,17,null,18,null,19,null,"20 - 24",null,"25 - 29",null,"30 - 34",null,"35 - 39",null,"40 - 44 ",null,"45 - 49",null,"50 - 54 ",null,"55 - 59 ",null,"60 - 64",null,"65 - 69 ",null,"70- 74 ",null,"75 - 79 ",null,"80 - +",null,null,null,"10-14","15-19","20-49","GESTANTES  ESPERADAS"]
[null,"Microredes",null,"RENAES","DISTRITO",null,null,null,null,null,"M","F","M","F","M","F","M","F","M","F","M","F","M","F","M","F","M","F","M","F","M","F","M","F","M","F","M","F","M","F","M","F","M","F","M","F","M","F","M","F","M","F","M","F","M","F","M","F","M","F","M","F","M","F","M","F","M","F","M","F","M","F","M","F","M","F"]
[150000,null,1,null,"HUAURA - OYON",234514,null,116119,118395,null,2195,2239,2102,2143,2042,2082,2011,2051,2006,2046,2021,2060,2051,2091,2096,2137,2149,2191,2205,2248,2266,2310,2332,2378,2376,2422,2387,2434,2373,2419,2359,2405,2344,2390,2308,2354,2241,2285,2154,2197,9682,9871,9157,9336,8760,8932,7814,7968,7137,7277,6499,6626,5283,5386,4585,4675,3722,3794,3112,3173,2687,2740,1868,1904,1795,1831,4453,340,11519,11260,49041,5499,null,4434,16483,51452,59106,28571,46923,80942,26626,null,{"$f":"SUM(U8:AD8)","v":21249},{"$f":"SUM(AE8:AX8)","v":46734},{"$f":"SUM(AY8:BN8)","v":118988}]
[150800,null,2,150800,"PROVINCIA HUAURA",211276,null,104612,106664,null,1936,1974,1851,1888,1797,1832,1769,1803,1763,1798,1777,1812,1806,1841,1847,1883,1897,1935,1949,1988,2008,2048,2070,2111,2115,2156,2135,2177,2136,2177,2135,2177,2136,2178,2112,2153,2054,2094,1974,2012,8850,9024,8249,8410,7886,8040,6983,7120,6487,6614,5884,6000,4832,4927,4201,4284,3422,3489,2805,2860,2432,2479,1669,1702,1645,1678,3925,301,10289,10287,44856,4845,null,3910,14501,45383,52759,25787,42667,73258,24181,null,18735,42158,107791]
[150801,null,3,150802,"DISTRITO HUACHO",57954,null,28696,29258,null,486,496,459,467,440,449,430,438,427,436,430,438,437,446,449,458,463,473,479,488,497,507,516,527,531,542,538,549,539,549,541,551,542,553,538,549,528,538,512,523,2360,2406,2207,2251,2123,2164,1949,1987,1881,1917,1755,1789,1543,1574,1320,1345,1052,1072,876,893,762,777,545,555,541,551,986,75,2663,2655,12866,1207,null,982,3546,11136,13130,6522,11325,21347,7624,null,4561,10670,30571]
[null,"00",4,7639,"HOSPITAL HUACHO",45202,null,22379,22823,null,379,387,357,365,343,350,335,342,333,340,335,342,341,348,350,357,361,369,373,381,388,395,403,411,414,423,420,428,420,429,422,430,423,431,420,428,411,420,400,407,1840,1877,1722,1755,1656,1688,1520,1550,1467,1495,1369,1395,1204,1227,1029,1050,820,837,683,697,594,606,425,433,422,430,769,58,2077,2071,10035,941,null,766,2765,8685,10242,5088,8832,16650,5947,null,3557,8323,23844]
[null,"02",5,5679,"C.S. MANZANARES",12752,null,6313,6439,null,107,109,101,103,97,99,95,96,94,96,95,96,96,98,99,101,102,104,105,108,109,112,113,116,117,119,118,121,118,121,119,121,119,122,118,121,116,119,113,115,519,530,486,495,467,476,429,437,414,422,386,394,340,346,290,296,231,236,193,196,168,171,120,122,119,121,217,17,586,584,2831,266,null,216,781,2451,2888,1434,2493,4697,1677,null,1004,2347,6727]
[150802,null,6,150802,"DISTRITO AMBAR",2834,null,1406,1428,null,21,22,26,27,30,30,33,33,35,36,37,37,38,38,38,38,38,38,37,37,36,36,35,35,33,33,31,31,29,30,26,27,24,24,22,23,21,22,22,22,106,108,89,90,91,92,78,80,69,70,78,79,63,64,52,54,48,49,43,44,33,33,21,22,23,24,43,3,148,109,490,53,null,43,250,811,851,333,480,870,340,null,376,562,1263]
[null,"01",7,5680,"C.S. AMBAR",1700,null,843,857,null,13,13,16,16,18,18,20,20,21,22,22,22,23,23,23,23,23,23,22,22,21,22,21,21,20,20,18,19,17,18,16,16,14,15,13,14,13,13,13,13,63,65,53,54,54,56,47,48,41,42,47,47,38,38,32,32,29,29,26,26,20,20,13,13,13,14,26,2,89,65,294,32,null,26,151,488,511,200,287,522,203,null,226,337,757]
[null,"01",8,5681,"P.S. AYNACA",1134,null,560,574,null,8,9,10,11,12,12,13,13,14,14,15,15,15,15,15,15,15,15,15,15,14,15,14,14,13,13,12,13,12,12,10,11,9,10,9,9,8,9,9,9,43,43,36,36,36,37,31,32,28,28,31,32,25,26,21,21,19,20,17,18,13,13,8,9,10,10,17,1,59,44,196,21,null,17,99,323,340,133,193,348,137,null,150,225,506]
[150803,null,9,150803,"DISTRITO CARQUIN",6540,null,3235,3305,null,63,65,61,62,59,60,57,59,56,58,55,57,55,56,55,56,55,56,55,56,55,57,55,57,56,57,56,58,57,59,57,59,58,59,58,60,59,60,59,61,297,302,299,305,293,299,223,227,226,230,172,175,150,153,122,124,93,95,86,88,61,62,35,36,37,37,128,10,258,287,1215,158,null,128,472,1380,1474,694,1442,2394,630,null,556,1157,3597]
[null,"02",10,5664,"P.S. CARQUIN",6540,null,3235,3305,null,63,65,61,62,59,60,57,59,56,58,55,57,55,56,55,56,55,56,55,56,55,57,55,57,56,57,56,58,57,59,57,59,58,59,58,60,59,60,59,61,297,302,299,305,293,299,223,227,226,230,172,175,150,153,122,124,93,95,86,88,61,62,35,36,37,37,128,10,258,287,1215,158,null,128,472,1380,1474,694,1442,2394,630,null,556,1157,3597]
[150804,null,11,150804,"DISTRITO CHECRAS",1654,null,818,836,null,14,15,13,13,12,13,12,12,12,12,12,12,13,13,13,14,14,15,15,15,16,16,17,17,17,18,16,17,15,15,13,14,12,12,10,11,9,10,9,9,32,32,43,44,40,41,53,55,52,53,49,50,59,60,44,45,45,45,37,37,51,51,27,27,22,23,29,2,76,44,274,36,null,29,99,330,372,170,188,601,365,null,136,273,752]
[null,"05",12,5663,"P.S. PUÑUN",1654,null,818,836,null,14,15,13,13,12,13,12,12,12,12,12,12,13,13,13,14,14,15,15,15,16,16,17,17,17,18,16,17,15,15,13,14,12,12,10,11,9,10,9,9,32,32,43,44,40,41,53,55,52,53,49,50,59,60,44,45,45,45,37,37,51,51,27,27,22,23,29,2,76,44,274,36,null,29,99,330,372,170,188,601,365,null,136,273,752]
[150805,null,13,150805,"DISTRITO HUALMAY",28163,null,13943,14220,null,259,264,244,249,234,239,229,234,228,233,230,235,235,240,242,247,250,255,259,264,268,274,279,285,286,292,288,293,285,290,282,287,279,285,274,280,267,273,258,264,1179,1202,1101,1123,1059,1079,957,975,908,926,753,767,640,652,582,594,456,464,389,397,296,301,222,227,225,230,525,40,1411,1398,6207,646,null,523,1890,5976,6984,3421,5667,9892,3207,null,2457,5589,14497]
{"$rows_left_out":74}
{"sheet":"etapas y mredes","index":2,"n_rows":38,"n_cols":21,"rows_kept":38,"cut":false,"hidden":false,"merged":[[6,15,6,20],[6,2,6,11],[1,2,5,12],[36,2,36,3],[35,2,35,3],[34,2,34,3],[33,2,33,3],[32,2,32,3],[31,2,31,3],[30,2,30,3],[29,2,29,3],[28,2,28,3],[27,2,27,3],[26,2,26,3],[25,2,25,3],[36,4,36,5],[35,4,35,5],[34,4,34,5],[33,4,33,5],[32,4,32,5],[31,4,31,5],[25,4,25,5],[30,4,30,5],[29,4,29,5],[28,4,28,5],[27,4,27,5],[26,4,26,5]]}
[]
[null,null,"POBLACION ASIGNADA POR DISTRITO SIERRA, HOSPITAL, MICROREDES Y POR ETAPAS DE VIDA 2011"]
[]
[]
[]
[]
[null,null,"DISTRITO",null,null,null,null,null,null,null,null,null,null,null,null,"MICROREDES"]
[null,null,66,68,11,74,60,28,76,33,null,null,null,4,null,82,83,84,85,86]
[null,"POBLACION POR\nETAPAS DE VIDA","Andajes","Caujul","Checras","Naván","Oyón","Paccho","Pachangara","Santa Leonor","TOTAL","PORC. (%)",null,"HOSPITAL HUACHO",null,"HUAURA","HUALMAY","SAYAN","VEGUETA","CHURIN OYON","Total Microredes"]
[76,"Neonatal (0-28dias)",{"$f":"VLOOKUP(C8,Poblacion!$C$8:$CQ$93,A10)","v":0},{"$f":"VLOOKUP($D$8,Poblacion!$C$8:$CQ$93,A10)","v":1},{"$f":"VLOOKUP($E$8,Poblacion!$C$8:$CQ$93,A10)","v":2},{"$f":"VLOOKUP($F$8,Poblacion!$C$8:$CQ$93,A10)","v":3},{"$f":"VLOOKUP($G$8,Poblacion!$C$8:$CQ$93,A10)","v":22},{"$f":"VLOOKUP($H$8,Poblacion!$C$8:$CQ$93,A10)","v":3},{"$f":"VLOOKUP($I$8,Poblacion!$C$8:$CQ$93,A10)","v":4},{"$f":"VLOOKUP($J$8,Poblacion!$C$8:$CQ$93,A10)","v":2},{"$f":"SUM(C10:J10)","v":37},{"$f":"IFERROR((K10/$K$20)*100,0)","v":0.16270888302550574},null,{"$f":"VLOOKUP(N$8,Poblacion!$C$8:$CQ$93,A10)","v":58},null,{"$f":"VLOOKUP(P$8,Poblacion!$C$8:$CQ$93,A10)","v":24},{"$f":"VLOOKUP(Q$8,Poblacion!$C$8:$CQ$93,A10)","v":47},{"$f":"VLOOKUP(R$8,Poblacion!$C$8:$CQ$93,A10)","v":42},{"$f":"VLOOKUP(S$8,Poblacion!$C$8:$CQ$93,A10)","v":11},{"$f":"VLOOKUP(T$8,Poblacion!$C$8:$CQ$93,A10)","v":15},{"$f":"SUM(P10:T10)","v":139}]
[82,"Infantil (Men.1año)",{"$f":"VLOOKUP($C$8,Poblacion!$C$8:$CQ$93,A11)","v":5},{"$f":"VLOOKUP($D$8,Poblacion!$C$8:$CQ$93,A11)","v":16},{"$f":"VLOOKUP($E$8,Poblacion!$C$8:$CQ$93,A11)","v":29},{"$f":"VLOOKUP($F$8,Poblacion!$C$8:$CQ$93,A11)","v":38},{"$f":"VLOOKUP($G$8,Poblacion!$C$8:$CQ$93,A11)","v":280},{"$f":"VLOOKUP($H$8,Poblacion!$C$8:$CQ$93,A11)","v":33},{"$f":"VLOOKUP($I$8,Poblacion!$C$8:$CQ$93,A11)","v":62},{"$f":"VLOOKUP($J$8,Poblacion!$C$8:$CQ$93,A11)","v":24},{"$f":"SUM(C11:J11)","v":487},{"$f":"IFERROR((K11/$K$20)*100,0)","v":2.1416007036059805},null,{"$f":"VLOOKUP(N$8,Poblacion!$C$8:$CQ$93,A11)","v":766},null,{"$f":"VLOOKUP(P$8,Poblacion!$C$8:$CQ$93,A11)","v":682},{"$f":"VLOOKUP(Q$8,Poblacion!$C$8:$CQ$93,A11)","v":1435},{"$f":"VLOOKUP(R$8,Poblacion!$C$8:$CQ$93,A11)","v":536},{"$f":"VLOOKUP(S$8,Poblacion!$C$8:$CQ$93,A11)","v":454},{"$f":"VLOOKUP(T$8,Poblacion!$C$8:$CQ$93,A11)","v":561},{"$f":"SUM(P11:T11)","v":3668}]
[83,"Pre-escolar (01-04años)",{"$f":"VLOOKUP($C$8,Poblacion!$C$8:$CQ$93,A12)","v":36},{"$f":"VLOOKUP($D$8,Poblacion!$C$8:$CQ$93,A12)","v":86},{"$f":"VLOOKUP($E$8,Poblacion!$C$8:$CQ$93,A12)","v":99},{"$f":"VLOOKUP($F$8,Poblacion!$C$8:$CQ$93,A12)","v":101},{"$f":"VLOOKUP($G$8,Poblacion!$C$8:$CQ$93,A12)","v":1041},{"$f":"VLOOKUP($H$8,Poblacion!$C$8:$CQ$93,A12)","v":137},{"$f":"VLOOKUP($I$8,Poblacion!$C$8:$CQ$93,A12)","v":206},{"$f":"VLOOKUP($J$8,Poblacion!$C$8:$CQ$93,A12)","v":92},1798,7.9067722075637645,null,{"$f":"VLOOKUP(N$8,Poblacion!$C$8:$CQ$93,A12)","v":2765},null,{"$f":"VLOOKUP(P$8,Poblacion!$C$8:$CQ$93,A12)","v":2607},{"$f":"VLOOKUP(Q$8,Poblacion!$C$8:$CQ$93,A12)","v":5285},{"$f":"VLOOKUP(R$8,Poblacion!$C$8:$CQ$93,A12)","v":2222},{"$f":"VLOOKUP(S$8,Poblacion!$C$8:$CQ$93,A12)","v":1537},{"$f":"VLOOKUP(T$8,Poblacion!$C$8:$CQ$93,A12)","v":2067},13718]
[84,"Niño (0-11años)",{"$f":"VLOOKUP($C$8,Poblacion!$C$8:$CQ$93,A13)","v":135},{"$f":"VLOOKUP($D$8,Poblacion!$C$8:$CQ$93,A13)","v":252},{"$f":"VLOOKUP($E$8,Poblacion!$C$8:$CQ$93,A13)","v":330},{"$f":"VLOOKUP($F$8,Poblacion!$C$8:$CQ$93,A13)","v":271},{"$f":"VLOOKUP($G$8,Poblacion!$C$8:$CQ$93,A13)","v":3186},{"$f":"VLOOKUP($H$8,Poblacion!$C$8:$CQ$93,A13)","v":450},{"$f":"VLOOKUP($I$8,Poblacion!$C$8:$CQ$93,A13)","v":640},{"$f":"VLOOKUP($J$8,Poblacion!$C$8:$CQ$93,A13)","v":345},5609,24.665787159190852,null,{"$f":"VLOOKUP(N$8,Poblacion!$C$8:$CQ$93,A13)","v":8685},null,{"$f":"VLOOKUP(P$8,Poblacion!$C$8:$CQ$93,A13)","v":8321},{"$f":"VLOOKUP(Q$8,Poblacion!$C$8:$CQ$93,A13)","v":16577},{"$f":"VLOOKUP(R$8,Poblacion!$C$8:$CQ$93,A13)","v":6813},{"$f":"VLOOKUP(S$8,Poblacion!$C$8:$CQ$93,A13)","v":4623},{"$f":"VLOOKUP(T$8,Poblacion!$C$8:$CQ$93,A13)","v":6433},42767]
[85,"Escolar  (05-17años)",{"$f":"VLOOKUP($C$8,Poblacion!$C$8:$CQ$93,A14)","v":181},{"$f":"VLOOKUP($D$8,Poblacion!$C$8:$CQ$93,A14)","v":249},{"$f":"VLOOKUP($E$8,Poblacion!$C$8:$CQ$93,A14)","v":372},{"$f":"VLOOKUP($F$8,Poblacion!$C$8:$CQ$93,A14)","v":234},{"$f":"VLOOKUP($G$8,Poblacion!$C$8:$CQ$93,A14)","v":3312},{"$f":"VLOOKUP($H$8,Poblacion!$C$8:$CQ$93,A14)","v":481},{"$f":"VLOOKUP($I$8,Poblacion!$C$8:$CQ$93,A14)","v":705},{"$f":"VLOOKUP($J$8,Poblacion!$C$8:$CQ$93,A14)","v":420},5954,26.182937554969214,null,{"$f":"VLOOKUP(N$8,Poblacion!$C$8:$CQ$93,A14)","v":10242},null,{"$f":"VLOOKUP(P$8,Poblacion!$C$8:$CQ$93,A14)","v":10035},{"$f":"VLOOKUP(Q$8,Poblacion!$C$8:$CQ$93,A14)","v":19225},{"$f":"VLOOKUP(R$8,Poblacion!$C$8:$CQ$93,A14)","v":7535},{"$f":"VLOOKUP(S$8,Poblacion!$C$8:$CQ$93,A14)","v":5248},{"$f":"VLOOKUP(T$8,Poblacion!$C$8:$CQ$93,A14)","v":6821},48864]
[86,"Adolescente (12-17años)",{"$f":"VLOOKUP($C$8,Poblacion!$C$8:$CQ$93,A15)","v":87},{"$f":"VLOOKUP($D$8,Poblacion!$C$8:$CQ$93,A15)","v":99},{"$f":"VLOOKUP($E$8,Poblacion!$C$8:$CQ$93,A15)","v":170},{"$f":"VLOOKUP($F$8,Poblacion!$C$8:$CQ$93,A15)","v":102},{"$f":"VLOOKUP($G$8,Poblacion!$C$8:$CQ$93,A15)","v":1447},{"$f":"VLOOKUP($H$8,Poblacion!$C$8:$CQ$93,A15)","v":201},{"$f":"VLOOKUP($I$8,Poblacion!$C$8:$CQ$93,A15)","v":333},{"$f":"VLOOKUP($J$8,Poblacion!$C$8:$CQ$93,A15)","v":191},2630,11.565523306948108,null,{"$f":"VLOOKUP(N$8,Poblacion!$C$8:$CQ$93,A15)","v":5088},null,{"$f":"VLOOKUP(P$8,Poblacion!$C$8:$CQ$93,A15)","v":5003},{"$f":"VLOOKUP(Q$8,Poblacion!$C$8:$CQ$93,A15)","v":9368},{"$f":"VLOOKUP(R$8,Poblacion!$C$8:$CQ$93,A15)","v":3480},{"$f":"VLOOKUP(S$8,Poblacion!$C$8:$CQ$93,A15)","v":2616},{"$f":"VLOOKUP(T$8,Poblacion!$C$8:$CQ$93,A15)","v":3016},23483]
[87,"Adulto Joven (18-29años)",{"$f":"VLOOKUP($C$8,Poblacion!$C$8:$CQ$93,A16)","v":153},{"$f":"VLOOKUP($D$8,Poblacion!$C$8:$CQ$93,A16)","v":164},{"$f":"VLOOKUP($E$8,Poblacion!$C$8:$CQ$93,A16)","v":188},{"$f":"VLOOKUP($F$8,Poblacion!$C$8:$CQ$93,A16)","v":208},{"$f":"VLOOKUP($G$8,Poblacion!$C$8:$CQ$93,A16)","v":2237},{"$f":"VLOOKUP($H$8,Poblacion!$C$8:$CQ$93,A16)","v":296},{"$f":"VLOOKUP($I$8,Poblacion!$C$8:$CQ$93,A16)","v":456},{"$f":"VLOOKUP($J$8,Poblacion!$C$8:$CQ$93,A16)","v":207},3909,17.189973614775724,null,{"$f":"VLOOKUP(N$8,Poblacion!$C$8:$CQ$93,A16)","v":8832},null,{"$f":"VLOOKUP(P$8,Poblacion!$C$8:$CQ$93,A16)","v":7726},{"$f":"VLOOKUP(Q$8,Poblacion!$C$8:$CQ$93,A16)","v":15677},{"$f":"VLOOKUP(R$8,Poblacion!$C$8:$CQ$93,A16)","v":5910},{"$f":"VLOOKUP(S$8,Poblacion!$C$8:$CQ$93,A16)","v":4290},{"$f":"VLOOKUP(T$8,Poblacion!$C$8:$CQ$93,A16)","v":4488},38091]
[88,"Adulto    (30-59años)",{"$f":"VLOOKUP($C$8,Poblacion!$C$8:$CQ$93,A17)","v":374},{"$f":"VLOOKUP($D$8,Poblacion!$C$8:$CQ$93,A17)","v":330},{"$f":"VLOOKUP($E$8,Poblacion!$C$8:$CQ$93,A17)","v":601},{"$f":"VLOOKUP($F$8,Poblacion!$C$8:$CQ$93,A17)","v":388},{"$f":"VLOOKUP($G$8,Poblacion!$C$8:$CQ$93,A17)","v":3795},{"$f":"VLOOKUP($H$8,Poblacion!$C$8:$CQ$93,A17)","v":761},{"$f":"VLOOKUP($I$8,Poblacion!$C$8:$CQ$93,A17)","v":901},{"$f":"VLOOKUP($J$8,Poblacion!$C$8:$CQ$93,A17)","v":517},7667,33.715919085312223,null,{"$f":"VLOOKUP(N$8,Poblacion!$C$8:$CQ$93,A17)","v":16650},null,{"$f":"VLOOKUP(P$8,Poblacion!$C$8:$CQ$93,A17)","v":12082},{"$f":"VLOOKUP(Q$8,Poblacion!$C$8:$CQ$93,A17)","v":27566},{"$f":"VLOOKUP(R$8,Poblacion!$C$8:$CQ$93,A17)","v":9307},{"$f":"VLOOKUP(S$8,Poblacion!$C$8:$CQ$93,A17)","v":6654},{"$f":"VLOOKUP(T$8,Poblacion!$C$8:$CQ$93,A17)","v":8683},64292]
[89,"Adu.Mayor (60 a MAS)",{"$f":"VLOOKUP($C$8,Poblacion!$C$8:$CQ$93,A18)","v":311},{"$f":"VLOOKUP($D$8,Poblacion!$C$8:$CQ$93,A18)","v":145},{"$f":"VLOOKUP($E$8,Poblacion!$C$8:$CQ$93,A18)","v":365},{"$f":"VLOOKUP($F$8,Poblacion!$C$8:$CQ$93,A18)","v":180},{"$f":"VLOOKUP($G$8,Poblacion!$C$8:$CQ$93,A18)","v":798},{"$f":"VLOOKUP($H$8,Poblacion!$C$8:$CQ$93,A18)","v":477},{"$f":"VLOOKUP($I$8,Poblacion!$C$8:$CQ$93,A18)","v":392},{"$f":"VLOOKUP($J$8,Poblacion!$C$8:$CQ$93,A18)","v":257},2925,12.862796833773087,null,{"$f":"VLOOKUP(N$8,Poblacion!$C$8:$CQ$93,A18)","v":5947},null,{"$f":"VLOOKUP(P$8,Poblacion!$C$8:$CQ$93,A18)","v":3461},{"$f":"VLOOKUP(Q$8,Poblacion!$C$8:$CQ$93,A18)","v":9160},{"$f":"VLOOKUP(R$8,Poblacion!$C$8:$CQ$93,A18)","v":2693},{"$f":"VLOOKUP(S$8,Poblacion!$C$8:$CQ$93,A18)","v":2174},{"$f":"VLOOKUP(T$8,Poblacion!$C$8:$CQ$93,A18)","v":3191},20679]
[80,"Gestantes",{"$f":"VLOOKUP($C$8,Poblacion!$C$8:$CQ$93,A19)","v":8},{"$f":"VLOOKUP($D$8,Poblacion!$C$8:$CQ$93,A19)","v":18},{"$f":"VLOOKUP($E$8,Poblacion!$C$8:$CQ$93,A19)","v":36},{"$f":"VLOOKUP($F$8,Poblacion!$C$8:$CQ$93,A19)","v":48},{"$f":"VLOOKUP($G$8,Poblacion!$C$8:$CQ$93,A19)","v":351},{"$f":"VLOOKUP($H$8,Poblacion!$C$8:$CQ$93,A19)","v":40},{"$f":"VLOOKUP($I$8,Poblacion!$C$8:$CQ$93,A19)","v":78},{"$f":"VLOOKUP($J$8,Poblacion!$C$8:$CQ$93,A19)","v":28},607,2.6693051890941075,null,{"$f":"VLOOKUP(N$8,Poblacion!$C$8:$CQ$93,A19)","v":941},null,{"$f":"VLOOKUP(P$8,Poblacion!$C$8:$CQ$93,A19)","v":393},{"$f":"VLOOKUP(Q$8,Poblacion!$C$8:$CQ$93,A19)","v":743},{"$f":"VLOOKUP(R$8,Poblacion!$C$8:$CQ$93,A19)","v":707},{"$f":"VLOOKUP(S$8,Poblacion!$C$8:$CQ$93,A19)","v":173},{"$f":"VLOOKUP(T$8,Poblacion!$C$8:$CQ$93,A19)","v":251},2267]
[null," TOTAL",{"$f":"C13+C15+C16+C17+C18","v":1060},{"$f":"D13+D15+D16+D17+D18","v":990},1654,1149,11463,2185,2722,1517,{"$f":"K13+K15+K16+K17+K18","v":22740},{"$f":"IFERROR((K20/$K$20)*100,0)","v":100},null,{"$f":"N13+N15+N16+N17+N18","v":45202},null,{"$f":"P13+P15+P16+P17+P18","v":36593},{"$f":"Q13+Q15+Q16+Q17+Q18","v":78348},28203,20357,{"$f":"T13+T15+T16+T17+T18","v":25811},{"$f":"U13+U15+U16+U17+U18","v":189312}]
{"$rows_left_out":19}
{"sheet":"Pobla_EESS","index":3,"n_rows":60,"n_cols":16,"rows_kept":60,"cut":false,"hidden":false,"merged":[[50,4,52,4],[51,11,54,11],[54,3,54,5],[55,11,57,11],[58,10,58,12],[1,3,4,10],[7,3,7,8],[7,10,7,15],[15,3,15,4],[25,4,29,4],[25,11,30,11],[30,4,31,4],[23,3,23,8],[23,10,23,15],[31,10,31,12],[39,4,45,4],[39,11,41,11],[42,11,46,11],[46,4,49,4],[9,4,13,4],[9,11,11,11],[12,11,16,11],[16,3,16,5],[19,10,19,12],[32,3,32,5],[37,3,37,8],[37,10,37,15]]}
[]
[null,null,null,"POBLACIÓN SEGÚN DISTRITOS Y EE.SS - 2011"]
[]
[]
[]
[]
[]
[null,null,null,"SIN MICRORED",null,null,null,null,null,null,"MICRORED HUALMAY"]
[null,null,null,"DISTRITO","POBLACIÓN","EE.SS","POBLACIÓN","MASCULINO","FEMENINO",null,"DISTRITO","POBLACIÓN","EE.SS","POBLACIÓN","MASCULINO","FEMENINO"]
[null,null,null,"HUACHO",{"$f":"G10","v":45202},"HOSPITAL HUACHO",{"$f":"VLOOKUP($F10,Poblacion!$E$8:$I$87,2,FALSE)","v":45202},{"$f":"VLOOKUP($F10,Poblacion!$E$8:$I$87,4,FALSE)","v":22379},{"$f":"VLOOKUP($F10,Poblacion!$E$8:$I$87,5,FALSE)","v":22823},null,"HUALMAY",{"$f":"SUM(N10:N12)","v":28163},"C.S. HUALMAY",{"$f":"VLOOKUP($M10,Poblacion!$E$8:$I$87,2,FALSE)","v":14884},{"$f":"VLOOKUP($M10,Poblacion!$E$8:$I$87,4,FALSE)","v":7370},{"$f":"VLOOKUP($M10,Poblacion!$E$8:$I$87,5,FALSE)","v":7514}]
[null,null,null,"HUACHO",null,"CLINICA SAN PEDRO",0,null,null,null,"HUALMAY",null,"P.S. DGO. MANDAMIENTO",{"$f":"VLOOKUP($M11,Poblacion!$E$8:$I$87,2,FALSE)","v":9294},{"$f":"VLOOKUP($M11,Poblacion!$E$8:$I$87,4,FALSE)","v":4603},{"$f":"VLOOKUP($M11,Poblacion!$E$8:$I$87,5,FALSE)","v":4691}]
[null,null,null,"HUACHO",null,"ESSALUD GUSTAVO LA NATA",0,null,null,null,"HUALMAY",null,"P.S. CAMPO ALEGRE",{"$f":"VLOOKUP($M12,Poblacion!$E$8:$I$87,2,FALSE)","v":3985},{"$f":"VLOOKUP($M12,Poblacion!$E$8:$I$87,4,FALSE)","v":1974},{"$f":"VLOOKUP($M12,Poblacion!$E$8:$I$87,5,FALSE)","v":2011}]
[null,null,null,"HUACHO",null,"CLINICA SAN BARTOLOME",0,null,null,null,"S.MARIA",{"$f":"SUM(N13:N17)","v":30893},"C.S. SANTA MARIA",{"$f":"VLOOKUP($M13,Poblacion!$E$8:$I$87,2,FALSE)","v":8650},{"$f":"VLOOKUP($M13,Poblacion!$E$8:$I$87,4,FALSE)","v":4284},{"$f":"VLOOKUP($M13,Poblacion!$E$8:$I$87,5,FALSE)","v":4366}]
[null,null,null,"HUACHO",null,"GOLD ESTANDAR EIRL.",0,null,null,null,"S.MARIA",null,"P.S. CHONTA",{"$f":"VLOOKUP($M14,Poblacion!$E$8:$I$87,2,FALSE)","v":4634},{"$f":"VLOOKUP($M14,Poblacion!$E$8:$I$87,4,FALSE)","v":2298},{"$f":"VLOOKUP($M14,Poblacion!$E$8:$I$87,5,FALSE)","v":2336}]
[null,null,null,"CARQUIN",null,"INSITUTO NACIONAL PENITENCIARIO CARQUIN",0,null,null,null,"S.MARIA",null,"P.S. ZAPATA",{"$f":"VLOOKUP($M15,Poblacion!$E$8:$I$87,2,FALSE)","v":2471},{"$f":"VLOOKUP($M15,Poblacion!$E$8:$I$87,4,FALSE)","v":1224},{"$f":"VLOOKUP($M15,Poblacion!$E$8:$I$87,5,FALSE)","v":1247}]
[null,null,null,null,null,"OTROS ESTABLECIMIENTOS",0,null,null,null,"S.MARIA",null,"P.S. AMADO VELASQUEZ",{"$f":"VLOOKUP($M16,Poblacion!$E$8:$I$87,2,FALSE)","v":8032},{"$f":"VLOOKUP($M16,Poblacion!$E$8:$I$87,4,FALSE)","v":3975},{"$f":"VLOOKUP($M16,Poblacion!$E$8:$I$87,5,FALSE)","v":4057}]
[null,null,null,"TOTAL SIN MICRORED",null,null,{"$f":"SUM(G10:G16)","v":45202},{"$f":"SUM(H10:H16)","v":22379},{"$f":"SUM(I10:I16)","v":22823},null,"S.MARIA",null,"P.S. SAN BARTOLOME",{"$f":"VLOOKUP($M17,Poblacion!$E$8:$I$87,2,FALSE)","v":7106},{"$f":"VLOOKUP($M17,Poblacion!$E$8:$I$87,4,FALSE)","v":3516},{"$f":"VLOOKUP($M17,Poblacion!$E$8:$I$87,5,FALSE)","v":3590}]
[null,null,null,{"$f":"'etapas y mredes'!B21","v":"Elaboración: Área de Estadística - RIS Huaura Oyón."},null,null,null,null,null,null,"CARQUIN",{"$f":"N18","v":6540},"P.S. CARQUIN",{"$f":"VLOOKUP($M18,Poblacion!$E$8:$I$87,2,FALSE)","v":6540},{"$f":"VLOOKUP($M18,Poblacion!$E$8:$I$87,4,FALSE)","v":3235},{"$f":"VLOOKUP($M18,Poblacion!$E$8:$I$87,5,FALSE)","v":3305}]
[null,null,null,null,null,null,null,null,null,null,"HUACHO",{"$f":"N19","v":12752},"C.S. MANZANARES",{"$f":"VLOOKUP($M19,Poblacion!$E$8:$I$87,2,FALSE)","v":12752},{"$f":"VLOOKUP($M19,Poblacion!$E$8:$I$87,4,FALSE)","v":6313},{"$f":"VLOOKUP($M19,Poblacion!$E$8:$I$87,5,FALSE)","v":6439}]
[null,null,null,null,null,null,null,null,null,null,"TOTAL MCR HUALMAY",null,"TOTAL MICRORED HUALMAY",{"$f":"SUM(N10:N19)","v":78348},{"$f":"SUM(O10:O19)","v":38792},{"$f":"SUM(P10:P19)","v":39556}]
{"$rows_left_out":40}