{"text_format":"1","workbook":"xlsx","n_sheets":4,"sheets":["Interfaz","Poblacion","etapas y mredes","Pobla_EESS"],"not_rendered":{"charts":1,"images":13,"macros":1,"external_links":1,"defined_names":4,"comments":0,"pivot_tables":0},"unopened":[],"bounds":{"document_bytes":16777216,"sheet_cells":100000,"rows_first":2000,"rows_last":500,"rows_between":2000,"halvings":0,"cell_chars":16384,"cell_head_chars":4096},"cells_cut":0,"cells_raw":0,"read":"whole","date_system":"1900"}

{"sheet":"Interfaz","index":0,"n_rows":27,"n_cols":18,"rows_kept":27,"cut":false,"hidden":false,"merged":[[4,2,7,11],[9,2,11,11]]}
[]
[]
[]
[]
[null,null,"POBLACIÓN ASIGNADA SEGÚN CENSOS INEI - RENIEC - PN - CNV - 2010"]
[]
[]
[]
[]
[null,null,"RED INTEGRADA DE SALUD HUAURA OYÓN "]
[]
[]
[]
[]
[]
{"$rows_left_out":13}
{"sheet":"Poblacion","index":1,"n_rows":92,"n_cols":107,"rows_kept":92,"cut":false,"hidden":false,"merged":[[4,63,6,63],[4,65,6,65],[4,74,6,74],[5,54,6,54],[5,55,6,55],[5,56,6,56],[5,57,6,57],[5,60,6,60],[5,61,6,61],[4,64,6,64],[2,68,2,75],[4,73,6,73],[4,72,6,72],[4,66,6,66],[4,67,6,67],[4,68,6,68],[4,70,6,70],[4,69,6,69],[4,52,4,53],[4,60,4,61],[5,52,5,53],[5,46,5,47],[5,48,5,49],[5,50,5,51],[4,50,4,51],[4,48,4,49],[4,59,6,59],[4,54,4,57],[4,58,6,58],[4,46,4,47],[1,18,1,43],[2,18,2,43],[4,36,4,37],[4,26,4,27],[3,18,3,43],[4,24,4,25],[4,34,4,35],[4,18,4,19],[4,20,4,21],[4,22,4,23],[4,28,4,29],[4,32,4,33],[4,42,4,43],[4,7,6,7],[4,8,6,8],[5,28,5,29],[4,30,4,31],[5,30,5,31],[4,10,4,11],[5,10,5,11],[4,12,4,13],[5,32,5,33],[4,38,4,39],[5,38,5,39],[4,40,4,41],[5,40,5,41],[5,42,5,43],[5,26,5,27],[5,34,5,35],[5,44,5,45],[4,5,6,5],[4,44,4,45],[5,12,5,13],[4,14,4,15],[5,14,5,15],[5,36,5,37],[5,24,5,25],[4,16,4,17],[5,20,5,21],[5,22,5,23],[5,16,5,17],[5,18,5,19]]}
[null,null,1,2,3,4,5,6,7,8,9,10,11,12,13,14,15,16,17,18,19,20,21,22,23,24,25,26,27,28,29,30,31,32,33,34,35,36,37,38,39,40,41,42,43,44,45,46,47,48,49,50,51,52,53,54,55,56,57,58,59,60,61,62,63,64,65,66,67,68,69,70,71,72,73,74,75,76,77,78,79,80,81,82,83,84,85,86,87,88,89,90,91,92,93,94,95,96,97,98,99,106,107,108,109,110,111]
[null,null,null,null,null,null,null,null,null,null,null,null,null,null,null,null,null,null,"POBLACIÓN ESTIMADA POR GRUPOS DE EDAD, SEGÚN PROVINCIAS DISTRITOS Y ESTABLECIMIENTOS DE SALUD"]
[null,null,null,null,null,null,null,null,null,null,null,null,null,null,null,null,null,null,"RED INTEGRADA DE SALUD HUAURA OYON   -   AÑO  2010",null,null,null,null,null,null,null,null,null,null,null,null,null,null,null,null,null,null,null,null,null,null,null,null,null,null,null,null,null,null,null,null,null,null,null,null,null,null,null,null,null,null,null,null,null,null,null,null,null,"MAS GRUPOS DE EDAD"]
[null,null,null,null,null,null,null,null,null,null,null,null,null,null,null,null,null,null,"EDADES PUNTUALES Y GRUPOS DE EDAD"]
[null,null,"N°",null,"DIRECCION DE SALUD","TOTAL GENERAL",null,"TOTAL MASCULINO","TOTAL FEMENINO",null,"EDAD",null,"EDAD",null,"EDAD",null,"EDAD",null,"EDAD",null,"EDAD",null,"EDAD",null,"EDAD",null,"EDAD",null,"EDAD",null,"EDAD",null,"EDAD",null,"EDAD",null,"EDAD",null,"EDAD",null,"EDAD",null,"EDAD",null,"EDAD",null,"EDAD",null,"EDAD",null,"EDAD",null,"EDAD",null,"GESTANTES",null,null,null,"NACIMIENTOS","28 DIAS DE NACIDO","POB.FEMENINA",null,null,"menor de 1 Año","Pre escolar         (1-4)","Niño             (0 - 11)","Escolar               (05 - 17)","Adolescente (12 - 17)","Adulto Joven (18 - 29)","Adulto            (30-59)","Adu.Mayor (60 a MAS)",null,"Escolar               (05 - 09)","Adolescente (10 - 19)","Adulto            (20-59)"]
["UBIGEO",null,null,null,"PROVINCIA",null,null,null,null,null,0,null,1,null,2,null,3,null,4,null,"5 - 9",null,"10 - 11",null,"12 - 17",null,"18 - 19",null,"20 - 24",null,"25 - 29",null,"30 - 34",null,"35 - 39",null,"40 - 44 ",null,"45 - 49",null,"50 - 54 ",null,"55 - 59 ",null,"60 - 64",null,"65 - 69 ",null,"70- 74 ",null,"75 - 79 ",null,"80 - +",null,"TOTAL","SECTOR PUBLICO","SECTOR PRIVADO","NO RECIBIERON\nATENCION",null,null,"10 - 19","15 - 49"]
[null,"Microredes",null,"RENAES","DISTRITO",null,null,null,null,null,"M","F","M","F","M","F","M","F","M","F","M","F","M","F","M","F","M","F","M","F","M","F","M","F","M","F","M","F","M","F","M","F","M","F","M","F","M","F","M","F","M","F","M","F"]
[150000,null,1,null,"HUAURA - OYON",242794,null,120219.4491,122574.5509,null,2092.5038999999997,2133.4961000000003,2082.6008999999999,2123.3991000000001,2085.07665,2125.92335,2084.5814999999998,2125.4185000000002,2087.0572499999998,2127.9427500000002,10373.887649999999,10577.112350000001,4116.1819500000001,4196.8180499999999,13379.44815,13641.55185,4656.8857499999995,4748.1142500000005,10826.9499,11039.0501,10719.502349999999,10929.497650000001,10284.2655,10485.7345,8598.2797499999997,8766.7202500000003,7854.5644499999999,8008.4355500000001,7044.4990499999994,7182.5009500000006,5661.5450999999994,5772.4549000000006,4632.6233999999995,4723.3766000000005,3619.5464999999999,3690.4535000000001,2822.8501499999998,2878.1498500000002,2195.4951000000001,2238.5048999999999,1566.6545999999998,1597.3454000000002,1434.44955,1462.55045,7279,5913,1243,123,4176,318,21881,68209,null,4226,16842,50332,56285,27021,52920,89015,23506,null,20951,44739,132530]
[150800,null,2,150800,"PROVINCIA HUAURA",216624,null,107261.37359999998,109362.62640000002,null,1867.21065,1903.78935,1857.8027999999999,1894.1972000000001,1860.27855,1896.72145,1860.7737,1897.2263,1861.2688499999999,1897.7311500000001,9255.8389499999994,9437.1610500000006,3672.5275499999998,3744.4724500000002,11936.581049999999,12170.418950000001,4155.2987999999996,4236.7012000000004,9659.8813499999997,9849.1186500000003,9564.3173999999999,9751.6826000000001,9175.6246499999997,9355.3753500000003,7671.3589499999998,7821.6410500000002,7008.3530999999994,7145.6469000000006,6285.4340999999995,6408.5659000000005,5051.0251499999995,5149.9748500000005,4133.0170499999995,4213.9829500000005,3229.3683000000001,3292.6316999999999,2518.8280500000001,2568.1719499999999,1958.8134,1997.1866,1397.80845,1425.19155,1279.9627499999999,1305.0372500000001,6479,5262,1107,110,3717,283,19481,60725,null,3771,15026,44907,50217,24107,47217,79420,20973,null,18693,39916,118245]
[150801,null,3,150802,"DISTRITO HUACHO",60846,null,30127.8969,30718.1031,null,522.38324999999998,532.61675000000002,521.88810000000001,532.11189999999999,522.38324999999998,532.61675000000002,522.38324999999998,532.61675000000002,522.87839999999994,533.12160000000006,2600.0326500000001,2650.9673499999999,1031.3974499999999,1051.6025500000001,3352.6606499999998,3418.3393500000002,1167.5636999999999,1190.4363000000001,2713.422,2766.578,2686.6839,2739.3161,2577.2557499999998,2627.7442500000002,2154.8928000000001,2197.1071999999999,1968.7164,2007.2836,1765.7049,1800.2951,1418.60475,1446.39525,1161.1267499999999,1183.8732500000001,907.11479999999995,924.88520000000005,707.56934999999999,721.43065000000001,550.11164999999994,560.88835000000006,392.65395000000001,400.34604999999999,360.4692,367.5308,1848,1501,316,31,1060,81,5583,17400,null,1055,4220,12609,14105,6771,13264,22309,5893,null,5251,11212,33215]
[null,"00",4,7639,"HOSPITAL HUACHO",48677,null,24102.416549999994,24574.583450000006,null,417.90659999999997,426.09340000000003,417.41145,425.58855,417.90659999999997,426.09340000000003,417.90659999999997,426.09340000000003,418.40174999999999,426.59825000000001,2080.1251499999998,2120.8748500000002,824.91989999999998,841.08010000000002,2682.2275500000001,2734.7724499999999,933.85289999999998,952.14710000000002,2170.7375999999999,2213.2624000000001,2149.4461499999998,2191.5538500000002,2061.8045999999999,2102.1954000000001,1724.1123,1757.8877,1575.07215,1605.92785,1412.6629499999999,1440.3370500000001,1134.8838000000001,1157.1161999999999,928.90139999999997,947.09860000000003,725.88990000000001,740.11009999999999,565.95645000000002,577.04354999999998,440.18834999999996,448.81165000000004,313.92509999999999,320.07490000000001,288.1773,293.8227,1479,1201,253,25,848,65,4466,13920,null,844,3376,10087,11284,5417,10611,17848,4714,null,4201,8969,26573]
[null,"02",5,5679,"P.S. MANZANARES",12169,null,6025.4803500000007,6143.5196499999993,null,104.47664999999999,106.52335000000001,104.47664999999999,106.52335000000001,104.47664999999999,106.52335000000001,104.47664999999999,106.52335000000001,104.47664999999999,106.52335000000001,519.90750000000003,530.09249999999997,206.47754999999998,210.52245000000002,670.43309999999997,683.56690000000003,233.71079999999998,238.28920000000002,542.68439999999998,553.31560000000002,537.23775000000001,547.76224999999999,515.45114999999998,525.54885000000002,430.78049999999996,439.21950000000004,393.64425,401.35575,353.04194999999999,359.95805000000001,283.72095000000002,289.27904999999998,232.22534999999999,236.77465000000001,181.22489999999999,184.77510000000001,141.6129,144.3871,109.9233,112.0767,78.728849999999994,80.271150000000006,72.291899999999998,73.708100000000002,369,300,63,6,212,16,1117,3480,null,211,844,2522,2821,1354,2653,4461,1179,null,1050,2243,6642]
[150802,null,6,150802,"DISTRITO AMBAR",3101,null,1535.4601500000001,1565.5398499999999,null,27.728400000000001,28.271599999999999,26.738099999999999,27.261900000000001,26.738099999999999,27.261900000000001,26.738099999999999,27.261900000000001,26.738099999999999,27.261900000000001,132.7002,135.2998,52.485900000000001,53.514099999999999,170.33159999999998,173.66840000000002,59.417999999999999,60.582000000000001,138.14685,140.85315,137.15654999999998,139.84345000000002,131.21474999999998,133.78525000000002,109.9233,112.0767,100.51545,102.48455,90.1173,91.8827,72.291899999999998,73.708100000000002,58.922849999999997,60.077150000000003,46.048949999999998,46.951050000000002,36.145949999999999,36.854050000000001,28.223549999999999,28.776450000000001,19.805999999999997,20.194000000000003,17.330249999999999,17.669750000000001,99,80,17,2,57,4,284,887,null,56,216,646,718,344,676,1137,298,null,268,570,1693]
[null,"01",7,5680,"C.S. AMBAR",1861,null,921.4741499999999,939.5258500000001,null,16.835100000000001,17.164899999999999,15.844799999999999,16.155200000000001,15.844799999999999,16.155200000000001,15.844799999999999,16.155200000000001,15.844799999999999,16.155200000000001,79.719149999999999,81.280850000000001,31.689599999999999,32.310400000000001,102.0009,103.9991,35.650799999999997,36.349200000000003,82.690049999999999,84.309950000000001,82.19489999999999,83.80510000000001,79.22399999999999,80.77600000000001,66.350099999999998,67.649900000000002,60.408299999999997,61.591700000000003,53.971350000000001,55.028649999999999,43.5732,44.4268,35.155650000000001,35.844349999999999,27.728400000000001,28.271599999999999,21.7866,22.2134,16.835100000000001,17.164899999999999,11.883599999999999,12.116400000000001,10.398149999999999,10.601850000000001,59,48,10,1,34,2,170,532,null,34,128,387,431,206,405,684,179,null,161,342,1017]
[null,"01",8,5681,"P.S. AYNACA",1240,null,613.98599999999999,626.01400000000001,null,10.8933,11.1067,10.8933,11.1067,10.8933,11.1067,10.8933,11.1067,10.8933,11.1067,52.981049999999996,54.018950000000004,20.796299999999999,21.203700000000001,68.330699999999993,69.669300000000007,23.767199999999999,24.232800000000001,55.456800000000001,56.543199999999999,54.961649999999999,56.038350000000001,51.990749999999998,53.009250000000002,43.5732,44.4268,40.107149999999997,40.892850000000003,36.145949999999999,36.854050000000001,28.718699999999998,29.281300000000002,23.767199999999999,24.232800000000001,18.320550000000001,18.679449999999999,14.359349999999999,14.640650000000001,11.388449999999999,11.611550000000001,7.9223999999999997,8.0776000000000003,6.9321000000000002,7.0678999999999998,40,32,7,1,23,2,114,355,null,22,88,259,287,138,271,453,119,null,107,228,676]
{"$rows_left_out":78}
{"sheet":"etapas y mredes","index":2,"n_rows":38,"n_cols":21,"rows_kept":38,"cut":false,"hidden":false,"merged":[[25,4,25,5],[30,4,30,5],[29,4,29,5],[28,4,28,5],[27,4,27,5],[26,4,26,5],[35,4,35,5],[34,4,34,5],[33,4,33,5],[32,4,32,5],[31,4,31,5],[6,15,6,20],[6,2,6,11],[1,2,5,12],[36,2,36,3],[35,2,35,3],[34,2,34,3],[33,2,33,3],[32,2,32,3],[31,2,31,3],[30,2,30,3],[29,2,29,3],[28,2,28,3],[27,2,27,3],[26,2,26,3],[25,2,25,3],[36,4,36,5]]}
[]
[null,null,"POBLACION ASIGNADA POR DISTRITO SIERRA, HOSPITAL, MICROREDES Y POR ETAPAS DE VIDA 2010"]
[]
[]
[]
[]
[null,null,"DISTRITO",null,null,null,null,null,null,null,null,null,null,null,null,"MICROREDES"]
[null,null,66,68,11,74,60,28,76,33,null,null,null,4,null,81,82,83,84,85]
[null,"POBLACION POR\nETAPAS DE VIDA","Andajes","Caujul","Checras","Naván","Oyón","Paccho","Pachangara","Santa Leonor","TOTAL","PORC. (%)",null,"HOSPITAL HUACHO",null,"HUAURA","HUALMAY","SAYAN","VEGUETA","CHURIN OYON","Total Microredes"]
[58,"Neonatal (0-28dias)",{"$f":"VLOOKUP(C8,Poblacion!$C$8:$BW$92,A10)","v":2},{"$f":"VLOOKUP($D$8,Poblacion!$C$8:$BW$92,A10)","v":1},{"$f":"VLOOKUP($E$8,Poblacion!$C$8:$BW$92,A10)","v":2},{"$f":"VLOOKUP($F$8,Poblacion!$C$8:$BW$92,A10)","v":2},{"$f":"VLOOKUP($G$8,Poblacion!$C$8:$BW$92,A10)","v":21},{"$f":"VLOOKUP($H$8,Poblacion!$C$8:$BW$92,A10)","v":3},{"$f":"VLOOKUP($I$8,Poblacion!$C$8:$BW$92,A10)","v":5},{"$f":"VLOOKUP($J$8,Poblacion!$C$8:$BW$92,A10)","v":2},{"$f":"SUM(C10:J10)","v":38},{"$f":"IFERROR((K10/$K$20)*100,0)","v":0.13300665033251663},null,{"$f":"VLOOKUP(N$8,Poblacion!$C$8:$BW$92,A10)","v":65},null,{"$f":"VLOOKUP(P$8,Poblacion!$C$8:$BW$92,A10)","v":45},{"$f":"VLOOKUP(Q$8,Poblacion!$C$8:$BW$92,A10)","v":105},{"$f":"VLOOKUP(R$8,Poblacion!$C$8:$BW$92,A10)","v":38},{"$f":"VLOOKUP(S$8,Poblacion!$C$8:$BW$92,A10)","v":27},{"$f":"VLOOKUP(T$8,Poblacion!$C$8:$BW$92,A10)","v":38},{"$f":"SUM(P10:T10)","v":253}]
[62,"Infantil (Men.1año)",{"$f":"VLOOKUP($C$8,Poblacion!$C$8:$BW$92,A11)","v":23},{"$f":"VLOOKUP($D$8,Poblacion!$C$8:$BW$92,A11)","v":16},{"$f":"VLOOKUP($E$8,Poblacion!$C$8:$BW$92,A11)","v":27},{"$f":"VLOOKUP($F$8,Poblacion!$C$8:$BW$92,A11)","v":24},{"$f":"VLOOKUP($G$8,Poblacion!$C$8:$BW$92,A11)","v":268},{"$f":"VLOOKUP($H$8,Poblacion!$C$8:$BW$92,A11)","v":41},{"$f":"VLOOKUP($I$8,Poblacion!$C$8:$BW$92,A11)","v":70},{"$f":"VLOOKUP($J$8,Poblacion!$C$8:$BW$92,A11)","v":30},{"$f":"SUM(C11:J11)","v":499},{"$f":"IFERROR((K11/$K$20)*100,0)","v":1.7465873293664682},null,{"$f":"VLOOKUP(N$8,Poblacion!$C$8:$BW$92,A11)","v":844},null,{"$f":"VLOOKUP(P$8,Poblacion!$C$8:$BW$92,A11)","v":652},{"$f":"VLOOKUP(Q$8,Poblacion!$C$8:$BW$92,A11)","v":1367},{"$f":"VLOOKUP(R$8,Poblacion!$C$8:$BW$92,A11)","v":515},{"$f":"VLOOKUP(S$8,Poblacion!$C$8:$BW$92,A11)","v":349},{"$f":"VLOOKUP(T$8,Poblacion!$C$8:$BW$92,A11)","v":499},{"$f":"SUM(P11:T11)","v":3382}]
[63,"Pre-escolar (01-04años)",{"$f":"VLOOKUP($C$8,Poblacion!$C$8:$BW$92,A12)","v":84},{"$f":"VLOOKUP($D$8,Poblacion!$C$8:$BW$92,A12)","v":77},{"$f":"VLOOKUP($E$8,Poblacion!$C$8:$BW$92,A12)","v":113},{"$f":"VLOOKUP($F$8,Poblacion!$C$8:$BW$92,A12)","v":90},{"$f":"VLOOKUP($G$8,Poblacion!$C$8:$BW$92,A12)","v":1068},{"$f":"VLOOKUP($H$8,Poblacion!$C$8:$BW$92,A12)","v":155},{"$f":"VLOOKUP($I$8,Poblacion!$C$8:$BW$92,A12)","v":276},{"$f":"VLOOKUP($J$8,Poblacion!$C$8:$BW$92,A12)","v":116},1979,6.9268463423171154,null,{"$f":"VLOOKUP(N$8,Poblacion!$C$8:$BW$92,A12)","v":3376},null,{"$f":"VLOOKUP(P$8,Poblacion!$C$8:$BW$92,A12)","v":2592},{"$f":"VLOOKUP(Q$8,Poblacion!$C$8:$BW$92,A12)","v":5459},{"$f":"VLOOKUP(R$8,Poblacion!$C$8:$BW$92,A12)","v":2045},{"$f":"VLOOKUP(S$8,Poblacion!$C$8:$BW$92,A12)","v":1391},{"$f":"VLOOKUP(T$8,Poblacion!$C$8:$BW$92,A12)","v":1979},13466]
[64,"Niño (0-11años)",{"$f":"VLOOKUP($C$8,Poblacion!$C$8:$BW$92,A13)","v":255},{"$f":"VLOOKUP($D$8,Poblacion!$C$8:$BW$92,A13)","v":228},{"$f":"VLOOKUP($E$8,Poblacion!$C$8:$BW$92,A13)","v":337},{"$f":"VLOOKUP($F$8,Poblacion!$C$8:$BW$92,A13)","v":269},{"$f":"VLOOKUP($G$8,Poblacion!$C$8:$BW$92,A13)","v":3191},{"$f":"VLOOKUP($H$8,Poblacion!$C$8:$BW$92,A13)","v":468},{"$f":"VLOOKUP($I$8,Poblacion!$C$8:$BW$92,A13)","v":826},{"$f":"VLOOKUP($J$8,Poblacion!$C$8:$BW$92,A13)","v":348},5922,20.728036401820091,null,{"$f":"VLOOKUP(N$8,Poblacion!$C$8:$BW$92,A13)","v":10087},null,{"$f":"VLOOKUP(P$8,Poblacion!$C$8:$BW$92,A13)","v":7747},{"$f":"VLOOKUP(Q$8,Poblacion!$C$8:$BW$92,A13)","v":16309},{"$f":"VLOOKUP(R$8,Poblacion!$C$8:$BW$92,A13)","v":6111},{"$f":"VLOOKUP(S$8,Poblacion!$C$8:$BW$92,A13)","v":4156},{"$f":"VLOOKUP(T$8,Poblacion!$C$8:$BW$92,A13)","v":5922},40245]
[65,"Escolar  (05-17años)",{"$f":"VLOOKUP($C$8,Poblacion!$C$8:$BW$92,A14)","v":284},{"$f":"VLOOKUP($D$8,Poblacion!$C$8:$BW$92,A14)","v":259},{"$f":"VLOOKUP($E$8,Poblacion!$C$8:$BW$92,A14)","v":380},{"$f":"VLOOKUP($F$8,Poblacion!$C$8:$BW$92,A14)","v":299},{"$f":"VLOOKUP($G$8,Poblacion!$C$8:$BW$92,A14)","v":3567},{"$f":"VLOOKUP($H$8,Poblacion!$C$8:$BW$92,A14)","v":524},{"$f":"VLOOKUP($I$8,Poblacion!$C$8:$BW$92,A14)","v":925},{"$f":"VLOOKUP($J$8,Poblacion!$C$8:$BW$92,A14)","v":387},6625,23.188659432971647,null,{"$f":"VLOOKUP(N$8,Poblacion!$C$8:$BW$92,A14)","v":11284},null,{"$f":"VLOOKUP(P$8,Poblacion!$C$8:$BW$92,A14)","v":8659},{"$f":"VLOOKUP(Q$8,Poblacion!$C$8:$BW$92,A14)","v":18238},{"$f":"VLOOKUP(R$8,Poblacion!$C$8:$BW$92,A14)","v":6832},{"$f":"VLOOKUP(S$8,Poblacion!$C$8:$BW$92,A14)","v":4647},{"$f":"VLOOKUP(T$8,Poblacion!$C$8:$BW$92,A14)","v":6625},45001]
[66,"Adolescente (12-17años)",{"$f":"VLOOKUP($C$8,Poblacion!$C$8:$BW$92,A15)","v":136},{"$f":"VLOOKUP($D$8,Poblacion!$C$8:$BW$92,A15)","v":124},{"$f":"VLOOKUP($E$8,Poblacion!$C$8:$BW$92,A15)","v":183},{"$f":"VLOOKUP($F$8,Poblacion!$C$8:$BW$92,A15)","v":144},{"$f":"VLOOKUP($G$8,Poblacion!$C$8:$BW$92,A15)","v":1712},{"$f":"VLOOKUP($H$8,Poblacion!$C$8:$BW$92,A15)","v":252},{"$f":"VLOOKUP($I$8,Poblacion!$C$8:$BW$92,A15)","v":445},{"$f":"VLOOKUP($J$8,Poblacion!$C$8:$BW$92,A15)","v":185},3181,11.134056702835142,null,{"$f":"VLOOKUP(N$8,Poblacion!$C$8:$BW$92,A15)","v":5417},null,{"$f":"VLOOKUP(P$8,Poblacion!$C$8:$BW$92,A15)","v":4156},{"$f":"VLOOKUP(Q$8,Poblacion!$C$8:$BW$92,A15)","v":8755},{"$f":"VLOOKUP(R$8,Poblacion!$C$8:$BW$92,A15)","v":3281},{"$f":"VLOOKUP(S$8,Poblacion!$C$8:$BW$92,A15)","v":2231},{"$f":"VLOOKUP(T$8,Poblacion!$C$8:$BW$92,A15)","v":3181},21604]
{"$rows_left_out":24}
{"sheet":"Pobla_EESS","index":3,"n_rows":60,"n_cols":16,"rows_kept":60,"cut":false,"hidden":false,"merged":[[39,4,45,4],[39,11,41,11],[42,11,46,11],[46,4,49,4],[9,4,13,4],[9,11,11,11],[12,11,16,11],[16,3,16,5],[19,10,19,12],[32,3,32,5],[37,3,37,8],[37,10,37,15],[1,3,4,10],[7,3,7,8],[7,10,7,15],[15,3,15,4],[25,4,29,4],[25,11,30,11],[30,4,31,4],[23,3,23,8],[23,10,23,15],[31,10,31,12],[50,4,52,4],[51,11,54,11],[54,3,54,5],[55,11,57,11],[58,10,58,12]]}
[]
[null,null,null,"POBLACIÓN SEGÚN DISTRITOS Y EE.SS - 2010"]
[]
[]
[]
[]
[]
[null,null,null,"SIN MICRORED",null,null,null,null,null,null,"MICRORED HUALMAY"]
[null,null,null,"DISTRITO","POBLACIÓN","EE.SS","POBLACIÓN","MASCULINO","FEMENINO",null,"DISTRITO","POBLACIÓN","EE.SS","POBLACIÓN","MASCULINO","FEMENINO"]
[null,null,null,"HUACHO",{"$f":"G10","v":48677},"HOSPITAL HUACHO",{"$f":"VLOOKUP($F10,Poblacion!$E$8:$I$92,2,FALSE)","v":48677},{"$f":"VLOOKUP($F10,Poblacion!$E$8:$I$92,4,FALSE)","v":24102.416549999994},{"$f":"VLOOKUP($F10,Poblacion!$E$8:$I$92,5,FALSE)","v":24574.583450000006},null,"HUALMAY",{"$f":"SUM(N10:N12)","v":29421},"C.S. HUALMAY",{"$f":"VLOOKUP($M10,Poblacion!$E$8:$I$92,2,FALSE)","v":15593},{"$f":"VLOOKUP($M10,Poblacion!$E$8:$I$92,4,FALSE)","v":7720.8739500000001},{"$f":"VLOOKUP($M10,Poblacion!$E$8:$I$92,5,FALSE)","v":7872.1260499999999}]
[null,null,null,"HUACHO",null,"CLINICA SAN PEDRO",0,null,null,null,"HUALMAY",null,"P.S.DGO. MANDAMIENTO",{"$f":"VLOOKUP($M11,Poblacion!$E$8:$I$92,2,FALSE)","v":9709},{"$f":"VLOOKUP($M11,Poblacion!$E$8:$I$92,4,FALSE)","v":4807.4113499999994},{"$f":"VLOOKUP($M11,Poblacion!$E$8:$I$92,5,FALSE)","v":4901.5886500000006}]
[null,null,null,"HUACHO",null,"ESSALUD GUSTAVO LA NATA",0,null,null,null,"HUALMAY",null,"P.S. CAMPO ALEGRE",{"$f":"VLOOKUP($M12,Poblacion!$E$8:$I$92,2,FALSE)","v":4119},{"$f":"VLOOKUP($M12,Poblacion!$E$8:$I$92,4,FALSE)","v":2039.5228499999996},{"$f":"VLOOKUP($M12,Poblacion!$E$8:$I$92,5,FALSE)","v":2079.4771500000006}]
[null,null,null,"HUACHO",null,"CLINICA SAN BARTOLOME",0,null,null,null,"S.MARIA",{"$f":"SUM(N13:N17)","v":30399},"C.S. SANTA MARIA",{"$f":"VLOOKUP($M13,Poblacion!$E$8:$I$92,2,FALSE)","v":8511},{"$f":"VLOOKUP($M13,Poblacion!$E$8:$I$92,4,FALSE)","v":4214.2216500000004},{"$f":"VLOOKUP($M13,Poblacion!$E$8:$I$92,5,FALSE)","v":4296.7783499999996}]
[null,null,null,"HUACHO",null,"GOLD ESTANDAR EIRL.",0,null,null,null,"S.MARIA",null,"P.S. CHONTA",{"$f":"VLOOKUP($M14,Poblacion!$E$8:$I$92,2,FALSE)","v":4560},{"$f":"VLOOKUP($M14,Poblacion!$E$8:$I$92,4,FALSE)","v":2257.884},{"$f":"VLOOKUP($M14,Poblacion!$E$8:$I$92,5,FALSE)","v":2302.116}]
[null,null,null,"CARQUIN",null,"INSITUTO NACIONAL PENITENCIARIO CARQUIN",0,null,null,null,"S.MARIA",null,"P.S. ZAPATA",{"$f":"VLOOKUP($M15,Poblacion!$E$8:$I$92,2,FALSE)","v":2432},{"$f":"VLOOKUP($M15,Poblacion!$E$8:$I$92,4,FALSE)","v":1204.2048000000002},{"$f":"VLOOKUP($M15,Poblacion!$E$8:$I$92,5,FALSE)","v":1227.7951999999998}]
{"$rows_left_out":45}